BDBM50500510 CHEMBL3746211
SMILES [Na;v0+].[Na;v0+].[#8-]S(=O)(=O)c1ccc2-[#6](=O)-c3cc(ccc3-[#6](=O)-c2c1)S([#8-])(=O)=O
InChI Key InChIKey=MSSUFHMGCXOVBZ-UHFFFAOYSA-L
Data  2 KI
  Tab Delimited (TSV)   2D SDfile   Computed 3D by Vconf -m prep SDfile
Find this compound or compounds like it in BindingDB:
Activity Spreadsheet -- Enzyme Inhibition Constant Data from BindingDB
Found 2 hits for monomerid = 50500510
Target5'-nucleotidase(Homo sapiens (Human))
Universit£
Curated by ChEMBL
LigandPNGBDBM50500510(CHEMBL3746211)
Affinity DataKi:  2.00E+6nM. Assay description: Competitive inhibition of 5'-nucleotidase (unknown origin) using varying level of IMP as substrate by Lineweaver-Burk plot analysis
In DepthDetails ArticlePubMed
TargetCytosolic purine 5'-nucleotidase(Homo sapiens)
Universit£
Curated by ChEMBL
LigandPNGBDBM50500510(CHEMBL3746211)
Affinity DataKi:  2.00E+6nM. Assay description: Inhibition of recombinant N-terminal truncated human cytosolic 5'-nucleotidase-2 assessed as inhibition of inosine 5'-monophosphate hydrolysis by rap...
In DepthDetails ArticlePubMed