BDBM50500676 CHEMBL3754636
SMILES COC(=O)[C@@H](NS(=O)(=O)NCC(C)C)C(C)C
InChI Key InChIKey=RAZLRPAFVUTHLL-VIFPVBQESA-N
Data  6 KI
  Tab Delimited (TSV)   2D SDfile   Computed 3D by Vconf -m prep SDfile
Find this compound or compounds like it in BindingDB:
Activity Spreadsheet -- Enzyme Inhibition Constant Data from BindingDB
Found 6 hits for monomerid = 50500676
TargetCarbonic anhydrase 7(Homo sapiens (Human))
National University Of La Plata
Curated by ChEMBL
LigandPNGBDBM50500676(CHEMBL3754636)
Affinity DataKi:  0.390nM. Assay description: Inhibition of recombinant human carbonic anhydrase 7 preincubated for 15 mins by stopped-flow CO2 hydration assay
Ligand InfoPC cidPC sid
In DepthDetails ArticlePubMed
TargetCarbonic anhydrase 14(Homo sapiens (Human))
National University Of La Plata
Curated by ChEMBL
LigandPNGBDBM50500676(CHEMBL3754636)
Affinity DataKi:  7.80nM. Assay description: Inhibition of recombinant human carbonic anhydrase 14 preincubated for 15 mins by stopped-flow CO2 hydration assay
Ligand InfoPC cidPC sid
In DepthDetails ArticlePubMed
TargetCarbonic anhydrase 12(Homo sapiens (Human))
National University Of La Plata
Curated by ChEMBL
LigandPNGBDBM50500676(CHEMBL3754636)
Affinity DataKi:  34nM. Assay description: Inhibition of recombinant human carbonic anhydrase 12 preincubated for 15 mins by stopped-flow CO2 hydration assay
Ligand InfoPC cidPC sid
In DepthDetails ArticlePubMed
TargetCarbonic anhydrase 9(Homo sapiens (Human))
National University Of La Plata
Curated by ChEMBL
LigandPNGBDBM50500676(CHEMBL3754636)
Affinity DataKi:  191nM. Assay description: Inhibition of recombinant human carbonic anhydrase 9 preincubated for 15 mins by stopped-flow CO2 hydration assay
Ligand InfoPC cidPC sid
In DepthDetails ArticlePubMed
TargetCarbonic anhydrase 1(Homo sapiens (Human))
National University Of La Plata
Curated by ChEMBL
LigandPNGBDBM50500676(CHEMBL3754636)
Affinity DataKi: >1.00E+4nM. Assay description: Inhibition of recombinant human carbonic anhydrase 1 preincubated for 15 mins by stopped-flow CO2 hydration assay
Ligand InfoPC cidPC sid
In DepthDetails ArticlePubMed
TargetCarbonic anhydrase 2(Homo sapiens (Human))
National University Of La Plata
Curated by ChEMBL
LigandPNGBDBM50500676(CHEMBL3754636)
Affinity DataKi: >1.00E+4nM. Assay description: Inhibition of recombinant human carbonic anhydrase 2 preincubated for 15 mins by stopped-flow CO2 hydration assay
Ligand InfoPC cidPC sid
In DepthDetails ArticlePubMed