BDBM50500683 CHEBI:82431::E952::Sodium Cyclamate
SMILES [Na;v0+].[#8-]S(=O)(=O)[#7]-[#6]-1-[#6]-[#6]-[#6]-[#6]-[#6]-1
InChI Key InChIKey=HCAJEUSONLESMK-UHFFFAOYSA-M
Data  6 KI
  Tab Delimited (TSV)   2D SDfile   Computed 3D by Vconf -m prep SDfile
Find this compound or compounds like it in BindingDB:
Activity Spreadsheet -- Enzyme Inhibition Constant Data from BindingDB
Found 6 hits for monomerid = 50500683
TargetCarbonic anhydrase 7(Homo sapiens (Human))
National University Of La Plata
Curated by ChEMBL
LigandPNGBDBM50500683(CHEBI:82431 | E952 | Sodium Cyclamate)
Affinity DataKi:  0.240nM. Assay description: Inhibition of recombinant human carbonic anhydrase 7 preincubated for 15 mins by stopped-flow CO2 hydration assay
In DepthDetails ArticlePubMed
TargetCarbonic anhydrase 12(Homo sapiens (Human))
National University Of La Plata
Curated by ChEMBL
LigandPNGBDBM50500683(CHEBI:82431 | E952 | Sodium Cyclamate)
Affinity DataKi:  3.80nM. Assay description: Inhibition of recombinant human carbonic anhydrase 12 preincubated for 15 mins by stopped-flow CO2 hydration assay
In DepthDetails ArticlePubMed
TargetCarbonic anhydrase 14(Homo sapiens (Human))
National University Of La Plata
Curated by ChEMBL
LigandPNGBDBM50500683(CHEBI:82431 | E952 | Sodium Cyclamate)
Affinity DataKi:  6.60nM. Assay description: Inhibition of recombinant human carbonic anhydrase 14 preincubated for 15 mins by stopped-flow CO2 hydration assay
In DepthDetails ArticlePubMed
TargetCarbonic anhydrase 9(Homo sapiens (Human))
National University Of La Plata
Curated by ChEMBL
LigandPNGBDBM50500683(CHEBI:82431 | E952 | Sodium Cyclamate)
Affinity DataKi:  81nM. Assay description: Inhibition of recombinant human carbonic anhydrase 9 preincubated for 15 mins by stopped-flow CO2 hydration assay
In DepthDetails ArticlePubMed
TargetCarbonic anhydrase 2(Homo sapiens (Human))
National University Of La Plata
Curated by ChEMBL
LigandPNGBDBM50500683(CHEBI:82431 | E952 | Sodium Cyclamate)
Affinity DataKi: >1.00E+4nM. Assay description: Inhibition of recombinant human carbonic anhydrase 2 preincubated for 15 mins by stopped-flow CO2 hydration assay
In DepthDetails ArticlePubMed
TargetCarbonic anhydrase 1(Homo sapiens (Human))
National University Of La Plata
Curated by ChEMBL
LigandPNGBDBM50500683(CHEBI:82431 | E952 | Sodium Cyclamate)
Affinity DataKi: >1.00E+4nM. Assay description: Inhibition of recombinant human carbonic anhydrase 1 preincubated for 15 mins by stopped-flow CO2 hydration assay
In DepthDetails ArticlePubMed