BDBM50502378 CHEMBL4541665
SMILES OC(=O)C(F)(F)F.OC(=O)C(F)(F)F.OC(=O)C(F)(F)F.CC(C)C[C@H](NC(=O)[C@@H](NC(=O)[C@H](Cc1ccc(O)cc1)NC(=O)[C@@H]1CCCN1C(=O)[C@H](CCCNC(N)=N)N(C)C(=O)[C@@H](N)CCCNC(N)=N)C(C)(C)C)C(O)=O
InChI Key InChIKey=DSQZIYVWFBMZHN-CALTXIARSA-N
Data  1 KI
  Tab Delimited (TSV)   2D SDfile   Computed 3D by Vconf -m prep SDfile
Find this compound or compounds like it in BindingDB:
Activity Spreadsheet -- Enzyme Inhibition Constant Data from BindingDB
Found 1 hit for monomerid = 50502378
TargetNeurotensin receptor type 1(Homo sapiens (Human))
University Of Regensburg
Curated by ChEMBL
LigandPNGBDBM50502378(CHEMBL4541665)
Affinity DataKi:  1.60nM. Assay description: Displacement of [3H]UR-MK300 from human NSTR1 in HT-29 cells incubated for 2 hrs by liquid scintillation counter
Ligand InfoPC cidPC sid
In DepthDetails ArticlePubMed