BDBM50502761 CHEMBL4448267
SMILES C(N1CCN(CC1)[C@H]1CC[C@H](CC1)c1ccccc1)c1ccc(\N=N\c2ccccc2)nc1
InChI Key InChIKey=YZSOQMZFWBOWEV-PBZNVEDGSA-N
Data  1 IC50
  Tab Delimited (TSV)   2D SDfile   Computed 3D by Vconf -m prep SDfile
Find this compound or compounds like it in BindingDB:
Activity Spreadsheet -- Enzyme Inhibition Constant Data from BindingDB
Found 1 hit for monomerid = 50502761
TargetTransient receptor potential cation channel subfamily V member 6(Homo sapiens (Human))
University Of Bern
Curated by ChEMBL
LigandPNGBDBM50502761(CHEMBL4448267)
Affinity DataIC50:  600nM. Assay description: Inhibition of human TRPV6 expressed in HEK293 cells assessed as reduction of Cd2+ influx preincubated for 5 mins followed by CdCl2 addition measured ...
Ligand InfoPC cidPC sid
In DepthDetails ArticlePubMed