BDBM50502762 CHEMBL4579017
SMILES C(N1CCN(CC1)[C@H]1CC[C@H](CC1)c1ccccc1)c1ccc(cc1)\N=N/c1ccccc1
InChI Key InChIKey=QLIGVLXYBKGYKY-IKLWZFDPSA-N
Data  1 IC50
  Tab Delimited (TSV)   2D SDfile   Computed 3D by Vconf -m prep SDfile
Find this compound or compounds like it in BindingDB:
Activity Spreadsheet -- Enzyme Inhibition Constant Data from BindingDB
Found 1 hit for monomerid = 50502762
TargetTransient receptor potential cation channel subfamily V member 6(Homo sapiens (Human))
University Of Bern
Curated by ChEMBL
LigandPNGBDBM50502762(CHEMBL4579017)
Affinity DataIC50:  1.70E+3nM. Assay description: Inhibition of human TRPV6 expressed in HEK293 cells assessed as reduction in Cd2+ influx preincubated for 5 mins followed by CdCl2 addition using 365...
Ligand InfoPC cidPC sid
In DepthDetails ArticlePubMed