BDBM50503097 CHEMBL4559531
SMILES CC(C)(C)NC(=O)N1CC(Cn2nc(C(=O)Nc3ccc(c(Cl)c3)-c3ccc(=O)[nH]n3)c3ccccc23)C1
InChI Key InChIKey=VKTHNGMMHIFEOQ-UHFFFAOYSA-N
Data  2 IC50  1 EC50
  Tab Delimited (TSV)   2D SDfile   Computed 3D by Vconf -m prep SDfile
Find this compound or compounds like it in BindingDB:
Activity Spreadsheet -- Enzyme Inhibition Constant Data from BindingDB
Found 3 hits for monomerid = 50503097
TargetTyrosine-protein kinase ZAP-70(Homo sapiens (Human))
Bristol-Myers Squibb
Curated by ChEMBL
LigandPNGBDBM50503097(CHEMBL4559531)
Affinity DataEC50:  7.90E+3nM. Assay description: Effect on ZAP70 phosphorylation in human Jurkat cells pre-incubated for 30 mins followed by anti-CD3/CD28 stimulation measured after 10 mins
Ligand InfoPC cidPC sid
In DepthDetails ArticlePubMed
TargetTyrosine-protein kinase Lck(Homo sapiens (Human))
Bristol-Myers Squibb
Curated by ChEMBL
LigandPNGBDBM50503097(CHEMBL4559531)
Affinity DataIC50: >5.00E+4nM. Assay description: Inhibition of His-tagged/GST-tagged LCK (unknown origin) incubated for 1 hr by TR-FRET assay
Ligand InfoPC cidPC sid
In DepthDetails ArticlePubMed
TargetTyrosine-protein kinase CSK(Homo sapiens (Human))
Bristol-Myers Squibb
Curated by ChEMBL
LigandPNGBDBM50503097(CHEMBL4559531)
Affinity DataIC50:  5.60E+3nM. Assay description: Inhibition of His-tagged/GST-tagged CSK (unknown origin) incubated for 1 hr by TR-FRET assay
Ligand InfoPC cidPC sid
In DepthDetails ArticlePubMed