BDBM50503100 CHEMBL4443654
SMILES CC(C)(C)NC(=O)N1CCC(CC1)n1nc(C(=O)Nc2ccc(NC(=O)c3cnn4ccccc34)c(Cl)c2)c2ccccc12
InChI Key InChIKey=OROLCINTIPDVAI-UHFFFAOYSA-N
Data  3 IC50  1 EC50
  Tab Delimited (TSV)   2D SDfile   Computed 3D by Vconf -m prep SDfile
Find this compound or compounds like it in BindingDB:
Activity Spreadsheet -- Enzyme Inhibition Constant Data from BindingDB
Found 4 hits for monomerid = 50503100
TargetTyrosine-protein kinase CSK(Homo sapiens (Human))
Bristol-Myers Squibb
Curated by ChEMBL
LigandPNGBDBM50503100(CHEMBL4443654)
Affinity DataIC50:  4nM. Assay description: Inhibition of CSK (unknown origin) using fluorescent labeled peptide as substrate in presence of ATP at Km concentration by caliper method
Ligand InfoPC cidPC sid
In DepthDetails ArticlePubMed
TargetTyrosine-protein kinase ZAP-70(Homo sapiens (Human))
Bristol-Myers Squibb
Curated by ChEMBL
LigandPNGBDBM50503100(CHEMBL4443654)
Affinity DataEC50:  49nM. Assay description: Effect on ZAP70 phosphorylation in human Jurkat cells pre-incubated for 30 mins followed by anti-CD3/CD28 stimulation measured after 10 mins
Ligand InfoPC cidPC sid
In DepthDetails ArticlePubMed
TargetTyrosine-protein kinase Lck(Homo sapiens (Human))
Bristol-Myers Squibb
Curated by ChEMBL
LigandPNGBDBM50503100(CHEMBL4443654)
Affinity DataIC50:  300nM. Assay description: Inhibition of His-tagged/GST-tagged LCK (unknown origin) incubated for 1 hr by TR-FRET assay
Ligand InfoPC cidPC sid
In DepthDetails ArticlePubMed
TargetTyrosine-protein kinase CSK(Homo sapiens (Human))
Bristol-Myers Squibb
Curated by ChEMBL
LigandPNGBDBM50503100(CHEMBL4443654)
Affinity DataIC50:  5nM. Assay description: Inhibition of His-tagged/GST-tagged CSK (unknown origin) incubated for 1 hr by TR-FRET assay
Ligand InfoPC cidPC sid
In DepthDetails ArticlePubMed