BDBM50503101 CHEMBL4469360
SMILES COc1ccc2c(cnn2c1)C(=O)Nc1ccc(NC(=O)c2nn(C)c3ccccc23)cc1C
InChI Key InChIKey=LXWXQRLCBZDGSZ-UHFFFAOYSA-N
Data  3 IC50  1 EC50
PDB links: 1 PDB ID matches this monomer.
  Tab Delimited (TSV)   2D SDfile   Computed 3D by Vconf -m prep SDfile
Find this compound or compounds like it in BindingDB:
Activity Spreadsheet -- Enzyme Inhibition Constant Data from BindingDB
Found 4 hits for monomerid = 50503101
TargetTyrosine-protein kinase CSK(Homo sapiens (Human))
Bristol-Myers Squibb
Curated by ChEMBL
LigandPNGBDBM50503101(CHEMBL4469360)
Affinity DataIC50:  13nM. Assay description: Inhibition of CSK (unknown origin) using fluorescent labeled peptide as substrate in presence of ATP at Km concentration by caliper method
In DepthDetails ArticlePubMed
TargetTyrosine-protein kinase Lck(Homo sapiens (Human))
Bristol-Myers Squibb
Curated by ChEMBL
LigandPNGBDBM50503101(CHEMBL4469360)
Affinity DataIC50:  42nM. Assay description: Inhibition of His-tagged/GST-tagged LCK (unknown origin) incubated for 1 hr by TR-FRET assay
TargetTyrosine-protein kinase ZAP-70(Homo sapiens (Human))
Bristol-Myers Squibb
Curated by ChEMBL
LigandPNGBDBM50503101(CHEMBL4469360)
Affinity DataEC50: >2.00E+4nM. Assay description: Effect on ZAP70 phosphorylation in human Jurkat cells pre-incubated for 30 mins followed by anti-CD3/CD28 stimulation measured after 10 mins
In DepthDetails ArticlePubMed
TargetTyrosine-protein kinase CSK(Homo sapiens (Human))
Bristol-Myers Squibb
Curated by ChEMBL
LigandPNGBDBM50503101(CHEMBL4469360)
Affinity DataIC50:  42nM. Assay description: Inhibition of His-tagged/GST-tagged CSK (unknown origin) incubated for 1 hr by TR-FRET assay
In DepthDetails ArticlePubMed