BDBM50503104 CHEMBL4591137
SMILES CCc1cc(NC(=O)c2nn(C3CCN(CC3)C(=O)NC(C)(C)C)c3ccccc23)ccc1-c1n[nH]c(=O)cc1C
InChI Key InChIKey=CBJJVDGOKCKJSU-UHFFFAOYSA-N
Data  2 IC50  1 EC50
  Tab Delimited (TSV)   2D SDfile   Computed 3D by Vconf -m prep SDfile
Find this compound or compounds like it in BindingDB:
Activity Spreadsheet -- Enzyme Inhibition Constant Data from BindingDB
Found 3 hits for monomerid = 50503104
TargetTyrosine-protein kinase CSK(Homo sapiens (Human))
Bristol-Myers Squibb
Curated by ChEMBL
LigandPNGBDBM50503104(CHEMBL4591137)
Affinity DataIC50:  70nM. Assay description: Inhibition of His-tagged/GST-tagged CSK (unknown origin) incubated for 1 hr by TR-FRET assay
Ligand InfoPC cidPC sid
In DepthDetails ArticlePubMed
TargetTyrosine-protein kinase ZAP-70(Homo sapiens (Human))
Bristol-Myers Squibb
Curated by ChEMBL
LigandPNGBDBM50503104(CHEMBL4591137)
Affinity DataEC50:  2.00E+3nM. Assay description: Effect on ZAP70 phosphorylation in human Jurkat cells pre-incubated for 30 mins followed by anti-CD3/CD28 stimulation measured after 10 mins
Ligand InfoPC cidPC sid
In DepthDetails ArticlePubMed
TargetTyrosine-protein kinase Lck(Homo sapiens (Human))
Bristol-Myers Squibb
Curated by ChEMBL
LigandPNGBDBM50503104(CHEMBL4591137)
Affinity DataIC50:  4.30E+4nM. Assay description: Inhibition of His-tagged/GST-tagged LCK (unknown origin) incubated for 1 hr by TR-FRET assay
Ligand InfoPC cidPC sid
In DepthDetails ArticlePubMed