BDBM50504916 CHEMBL4475496
SMILES NS(=O)(=O)c1cc(C(=O)NCCCO)c(Sc2ccccc2)cc1Cl
InChI Key InChIKey=BMTAXVGCZUSPJX-UHFFFAOYSA-N
Data  24 Kd
PDB links: 2 PDB IDs match this monomer.
  Tab Delimited (TSV)   2D SDfile   Computed 3D by Vconf -m prep SDfile
Find this compound or compounds like it in BindingDB:
Activity Spreadsheet -- Enzyme Inhibition Constant Data from BindingDB
Found 24 hits for monomerid = 50504916
TargetCarbonic anhydrase 3(Homo sapiens (Human))
Vilnius University
Curated by ChEMBL
LigandPNGBDBM50504916(CHEMBL4475496)
Affinity DataKd:  79nM. Assay description: Binding affinity to recombinant human carbonic anhydrase 3 expressed in Escherichia coli expression system assessed as kinetic dissociation constant ...
Ligand InfoPC cidPC sidPDB
In DepthDetails ArticlePubMed
TargetCarbonic anhydrase 5A, mitochondrial(Homo sapiens (Human))
Vilnius University
Curated by ChEMBL
LigandPNGBDBM50504916(CHEMBL4475496)
Affinity DataKd:  4.50E+3nM. Assay description: Binding affinity to recombinant human carbonic anhydrase 5a expressed in Escherichia coli expression system assessed as observed dissociation constan...
Ligand InfoPC cidPC sidPDB
In DepthDetails ArticlePubMed
TargetCarbonic anhydrase 6(Homo sapiens (Human))
Vilnius University
Curated by ChEMBL
LigandPNGBDBM50504916(CHEMBL4475496)
Affinity DataKd:  830nM. Assay description: Binding affinity to recombinant human carbonic anhydrase 6 expressed in Escherichia coli expression system assessed as observed dissociation constant...
Ligand InfoPC cidPC sidPDB
In DepthDetails ArticlePubMed
TargetCarbonic anhydrase 7(Homo sapiens (Human))
Vilnius University
Curated by ChEMBL
LigandPNGBDBM50504916(CHEMBL4475496)
Affinity DataKd:  1.30nM. Assay description: Binding affinity to recombinant human carbonic anhydrase 7 expressed in Escherichia coli expression system assessed as observed dissociation constant...
Ligand InfoPC cidPC sidPDB
In DepthDetails ArticlePubMed
TargetCarbonic anhydrase 13(Homo sapiens (Human))
Vilnius University
Curated by ChEMBL
LigandPNGBDBM50504916(CHEMBL4475496)
Affinity DataKd:  180nM. Assay description: Binding affinity to recombinant human carbonic anhydrase 13 expressed in Escherichia coli expression system assessed as observed dissociation constan...
Ligand InfoPC cidPC sidPDB
In DepthDetails ArticlePubMed
TargetCarbonic anhydrase 14(Homo sapiens (Human))
Vilnius University
Curated by ChEMBL
LigandPNGBDBM50504916(CHEMBL4475496)
Affinity DataKd:  0.0200nM. Assay description: Binding affinity to recombinant human carbonic anhydrase 14 expressed in Escherichia coli expression system assessed as kinetic dissociation constant...
Ligand InfoPC cidPC sidPDB
In DepthDetails ArticlePubMed
TargetCarbonic anhydrase 9(Homo sapiens (Human))
Vilnius University
Curated by ChEMBL
LigandPNGBDBM50504916(CHEMBL4475496)
Affinity DataKd:  2nM. Assay description: Binding affinity to recombinant human carbonic anhydrase 9 expressed in mammalian cell expression system assessed as observed dissociation constant f...
Ligand InfoPC cidPC sidPDB
TargetCarbonic anhydrase 5A, mitochondrial(Homo sapiens (Human))
Vilnius University
Curated by ChEMBL
LigandPNGBDBM50504916(CHEMBL4475496)
Affinity DataKd:  30nM. Assay description: Binding affinity to recombinant human carbonic anhydrase 5a expressed in Escherichia coli expression system assessed as kinetic dissociation constant...
Ligand InfoPC cidPC sidPDB
In DepthDetails ArticlePubMed
TargetCarbonic anhydrase 5B, mitochondrial(Homo sapiens (Human))
Vilnius University
Curated by ChEMBL
LigandPNGBDBM50504916(CHEMBL4475496)
Affinity DataKd:  0.640nM. Assay description: Binding affinity to recombinant human carbonic anhydrase 5b expressed in Escherichia coli expression system assessed as kinetic dissociation constant...
Ligand InfoPC cidPC sidPDB
In DepthDetails ArticlePubMed
TargetCarbonic anhydrase 12(Homo sapiens (Human))
Vilnius University
Curated by ChEMBL
LigandPNGBDBM50504916(CHEMBL4475496)
Affinity DataKd:  0.830nM. Assay description: Binding affinity to recombinant human carbonic anhydrase 12 expressed in Escherichia coli expression system assessed as observed dissociation constan...
Ligand InfoPC cidPC sidPDB
In DepthDetails ArticlePubMed
TargetCarbonic anhydrase 3(Homo sapiens (Human))
Vilnius University
Curated by ChEMBL
LigandPNGBDBM50504916(CHEMBL4475496)
Affinity DataKd:  3.30E+4nM. Assay description: Binding affinity to recombinant human carbonic anhydrase 3 expressed in Escherichia coli expression system assessed as observed dissociation constant...
Ligand InfoPC cidPC sidPDB
In DepthDetails ArticlePubMed
TargetCarbonic anhydrase 14(Homo sapiens (Human))
Vilnius University
Curated by ChEMBL
LigandPNGBDBM50504916(CHEMBL4475496)
Affinity DataKd:  5.60nM. Assay description: Binding affinity to recombinant human carbonic anhydrase 14 expressed in Escherichia coli expression system assessed as observed dissociation constan...
Ligand InfoPC cidPC sidPDB
In DepthDetails ArticlePubMed
TargetCarbonic anhydrase 6(Homo sapiens (Human))
Vilnius University
Curated by ChEMBL
LigandPNGBDBM50504916(CHEMBL4475496)
Affinity DataKd:  0.75nM. Assay description: Binding affinity to recombinant human carbonic anhydrase 6 expressed in Escherichia coli expression system assessed as kinetic dissociation constant ...
Ligand InfoPC cidPC sidPDB
In DepthDetails ArticlePubMed
TargetCarbonic anhydrase 1(Homo sapiens (Human))
Vilnius University
Curated by ChEMBL
LigandPNGBDBM50504916(CHEMBL4475496)
Affinity DataKd:  62nM. Assay description: Binding affinity to recombinant human carbonic anhydrase 1 expressed in Escherichia coli expression system assessed as kinetic dissociation constant ...
Ligand InfoPC cidPC sidPDB
In DepthDetails ArticlePubMed
TargetCarbonic anhydrase 9(Homo sapiens (Human))
Vilnius University
Curated by ChEMBL
LigandPNGBDBM50504916(CHEMBL4475496)
Affinity DataKd:  0.00600nM. Assay description: Binding affinity to recombinant human carbonic anhydrase 9 expressed in mammalian cell expression system assessed as kinetic dissociation constant fl...
Ligand InfoPC cidPC sidPDB
TargetCarbonic anhydrase 13(Homo sapiens (Human))
Vilnius University
Curated by ChEMBL
LigandPNGBDBM50504916(CHEMBL4475496)
Affinity DataKd:  1.60nM. Assay description: Binding affinity to recombinant human carbonic anhydrase 13 expressed in Escherichia coli expression system assessed as kinetic dissociation constant...
Ligand InfoPC cidPC sidPDB
In DepthDetails ArticlePubMed
TargetCarbonic anhydrase 2(Homo sapiens (Human))
Vilnius University
Curated by ChEMBL
LigandPNGBDBM50504916(CHEMBL4475496)
Affinity DataKd:  0.0200nM. Assay description: Binding affinity to recombinant human carbonic anhydrase 2 expressed in Escherichia coli expression system assessed as kinetic dissociation constant ...
Ligand InfoPC cidPC sidPDB
In DepthDetails ArticlePubMed
TargetCarbonic anhydrase 1(Homo sapiens (Human))
Vilnius University
Curated by ChEMBL
LigandPNGBDBM50504916(CHEMBL4475496)
Affinity DataKd:  6.70E+3nM. Assay description: Binding affinity to recombinant human carbonic anhydrase 1 expressed in Escherichia coli expression system assessed as observed dissociation constant...
Ligand InfoPC cidPC sidPDB
In DepthDetails ArticlePubMed
TargetCarbonic anhydrase 7(Homo sapiens (Human))
Vilnius University
Curated by ChEMBL
LigandPNGBDBM50504916(CHEMBL4475496)
Affinity DataKd:  0.00500nM. Assay description: Binding affinity to recombinant human carbonic anhydrase 7 expressed in Escherichia coli expression system assessed as kinetic dissociation constant ...
Ligand InfoPC cidPC sidPDB
In DepthDetails ArticlePubMed
TargetCarbonic anhydrase 12(Homo sapiens (Human))
Vilnius University
Curated by ChEMBL
LigandPNGBDBM50504916(CHEMBL4475496)
Affinity DataKd:  0.00300nM. Assay description: Binding affinity to recombinant human carbonic anhydrase 12 expressed in Escherichia coli expression system assessed as kinetic dissociation constant...
Ligand InfoPC cidPC sidPDB
In DepthDetails ArticlePubMed
TargetCarbonic anhydrase 5B, mitochondrial(Homo sapiens (Human))
Vilnius University
Curated by ChEMBL
LigandPNGBDBM50504916(CHEMBL4475496)
Affinity DataKd:  130nM. Assay description: Binding affinity to recombinant human carbonic anhydrase 5b expressed in Escherichia coli expression system assessed as observed dissociation constan...
Ligand InfoPC cidPC sidPDB
In DepthDetails ArticlePubMed
TargetCarbonic anhydrase 4(Homo sapiens (Human))
Vilnius University
Curated by ChEMBL
LigandPNGBDBM50504916(CHEMBL4475496)
Affinity DataKd:  1.70nM. Assay description: Binding affinity to recombinant human carbonic anhydrase 4 expressed in Escherichia coli expression system assessed as observed dissociation constant...
Ligand InfoPC cidPC sidPDB
In DepthDetails ArticlePubMed
TargetCarbonic anhydrase 2(Homo sapiens (Human))
Vilnius University
Curated by ChEMBL
LigandPNGBDBM50504916(CHEMBL4475496)
Affinity DataKd:  5nM. Assay description: Binding affinity to recombinant human carbonic anhydrase 2 expressed in Escherichia coli expression system assessed as observed dissociation constant...
Ligand InfoPC cidPC sidPDB
In DepthDetails ArticlePubMed
TargetCarbonic anhydrase 4(Homo sapiens (Human))
Vilnius University
Curated by ChEMBL
LigandPNGBDBM50504916(CHEMBL4475496)
Affinity DataKd:  0.00500nM. Assay description: Binding affinity to recombinant human carbonic anhydrase 4 expressed in Escherichia coli expression system assessed as kinetic dissociation constant ...
Ligand InfoPC cidPC sidPDB
In DepthDetails ArticlePubMed