BDBM50505993 CHEMBL4587118
SMILES Cc1cnc(Nc2ccnn2C)nc1-c1cc2C(=O)N(Cc3ccc(F)c(F)c3)CCn2c1
InChI Key InChIKey=WASHBTYJUCCBAU-UHFFFAOYSA-N
Data  3 IC50
  Tab Delimited (TSV)   2D SDfile   Computed 3D by Vconf -m prep SDfile
Find this compound or compounds like it in BindingDB:
Activity Spreadsheet -- Enzyme Inhibition Constant Data from BindingDB
Found 3 hits for monomerid = 50505993
TargetMitogen-activated protein kinase 1(Homo sapiens (Human))
Astrazeneca
Curated by ChEMBL
LigandPNGBDBM50505993(CHEMBL4587118)
Affinity DataIC50:  0.350nM. Assay description: Inhibition of MEK U911-activated ERK2 (unknown origin) using ERKtide as substrate preincubated for 20 mins followed by substrate addition in presence...
Ligand InfoPC cidPC sid
In DepthDetails ArticlePubMed
TargetMitogen-activated protein kinase 1(Homo sapiens (Human))
Astrazeneca
Curated by ChEMBL
LigandPNGBDBM50505993(CHEMBL4587118)
Affinity DataIC50: <0.300nM. Assay description: Inhibition of MEK U911-activated ERK2 (unknown origin) using ERKtide as substrate preincubated for 20 mins followed by substrate addition in presence...
Ligand InfoPC cidPC sid
In DepthDetails ArticlePubMed
TargetMitogen-activated protein kinase 1/3(Homo sapiens (Human))
Astrazeneca
Curated by ChEMBL
LigandPNGBDBM50505993(CHEMBL4587118)
Affinity DataIC50:  20nM. Assay description: Inhibition of ERK1/2 in human A375 cells assessed as inhibition of RSK phosphorylation after 2 hrs
Ligand InfoPC cidPC sid
In DepthDetails ArticlePubMed