BDBM50506163 CHEMBL4561582
SMILES NS(=O)(=O)c1cc(NC(=O)Cc2ccccc2Cl)ccc1Oc1ccc(cc1)C1CCOC1
InChI Key InChIKey=PCTVDWXPDCYETC-UHFFFAOYSA-N
Data  1 IC50
  Tab Delimited (TSV)   2D SDfile   Computed 3D by Vconf -m prep SDfile
Find this compound or compounds like it in BindingDB:
Activity Spreadsheet -- Enzyme Inhibition Constant Data from BindingDB
Found 1 hit for monomerid = 50506163
TargetP2X purinoceptor 4(Homo sapiens (Human))
Bayer
Curated by ChEMBL
LigandPNGBDBM50506163(CHEMBL4561582)
Affinity DataIC50:  75nM. Assay description: Antagonist activity at human P2X4 receptor tranfected in HEK293 cells assessed as inhibition of Bz-ATP-induced calcium influx incubated for 30 mins a...
Ligand InfoPC cidPC sid
In DepthDetails ArticlePubMed