BDBM50506530 CHEMBL4514021
SMILES CC(C)[C@@H]1NC(=O)C[C@H](O)[C@H](Cc2ccccc2)NC(=O)OCCCCCCCCCCCNC1=O
InChI Key InChIKey=ISMDILRWKSYCOD-GNKBHMEESA-N
Data  1 IC50
PDB links: 1 PDB ID matches this monomer.
  Tab Delimited (TSV)   2D SDfile   Computed 3D by Vconf -m prep SDfile
Find this compound or compounds like it in BindingDB:
Activity Spreadsheet -- Enzyme Inhibition Constant Data from BindingDB
Found 1 hit for monomerid = 50506530
TargetCathepsin D(Homo sapiens (Human))
Czech Academy Of Sciences
Curated by ChEMBL
LigandPNGBDBM50506530(CHEMBL4514021)
Affinity DataIC50:  2.5nM. Assay description: Inhibition of human placenta CatD using Abz-Lys-Pro-Ala-Glu-Phe-Nph-Ala-Leu as substrate preincubated for 10 mins followed by substrate addition and ...
Ligand InfoPC cidPC sidPDB