BDBM50506535 CHEMBL4560400
SMILES CC(C)[C@@H]1NC(=O)C[C@H](O)[C@H](Cc2ccccc2)NC(=O)CCCCCCCCCCCCNC1=O
InChI Key InChIKey=CSFCSRFSEZSSMO-VBOOUTDYSA-N
Data  1 IC50
  Tab Delimited (TSV)   2D SDfile   Computed 3D by Vconf -m prep SDfile
Find this compound or compounds like it in BindingDB:
Activity Spreadsheet -- Enzyme Inhibition Constant Data from BindingDB
Found 1 hit for monomerid = 50506535
TargetCathepsin D(Homo sapiens (Human))
Czech Academy Of Sciences
Curated by ChEMBL
LigandPNGBDBM50506535(CHEMBL4560400)
Affinity DataIC50:  3.5nM. Assay description: Inhibition of human placenta CatD using Abz-Lys-Pro-Ala-Glu-Phe-Nph-Ala-Leu as substrate preincubated for 10 mins followed by substrate addition and ...
Ligand InfoPC cidPC sid
In DepthDetails ArticlePubMed