BDBM50506541 CHEMBL4576166
SMILES CC(C)[C@@H]1NC(=O)C[C@H](O)[C@H](Cc2ccc3ccccc3c2)NC(=O)CCCCCCCCCCCNC1=O
InChI Key InChIKey=YVZCVARIDAMNNV-QYDYLWNGSA-N
Data  1 IC50
PDB links: 1 PDB ID matches this monomer.
  Tab Delimited (TSV)   2D SDfile   Computed 3D by Vconf -m prep SDfile
Find this compound or compounds like it in BindingDB:
Activity Spreadsheet -- Enzyme Inhibition Constant Data from BindingDB
Found 1 hit for monomerid = 50506541
TargetCathepsin D(Homo sapiens (Human))
Czech Academy Of Sciences
Curated by ChEMBL
LigandPNGBDBM50506541(CHEMBL4576166)
Affinity DataIC50:  0.600nM. Assay description: Inhibition of human placenta CatD using Abz-Lys-Pro-Ala-Glu-Phe-Nph-Ala-Leu as substrate preincubated for 10 mins followed by substrate addition and ...
Ligand InfoPC cidPC sidPDB