BDBM50507261 CHEMBL4437353
SMILES CCOC(=O)c1cnn(c1-n1nnc2ccccc2c1=O)-c1ccccn1
InChI Key InChIKey=MPUDTYAJIZVZRO-UHFFFAOYSA-N
Data  1 IC50
  Tab Delimited (TSV)   2D SDfile   Computed 3D by Vconf -m prep SDfile
Find this compound or compounds like it in BindingDB:
Activity Spreadsheet -- Enzyme Inhibition Constant Data from BindingDB
Found 1 hit for monomerid = 50507261
TargetProstaglandin G/H synthase 2(Homo sapiens (Human))
Universidad Tecnol£Gica De Pereira
Curated by ChEMBL
LigandPNGBDBM50507261(CHEMBL4437353)
Affinity DataIC50:  2.00E+4nM. Assay description: Inhibition of COX2 (unknown origin) using arachidonic acid as substrate preincubated for 20 mins followed by substrate addition measured at 1 sec int...
Ligand InfoPC cidPC sid
In DepthDetails ArticlePubMed