BDBM50507263 CHEMBL4474936
SMILES CCOC(=O)CSc1nnc(-c2ccc(cc2)S(C)(=O)=O)c(n1)-c1ccc(Cl)cc1
InChI Key InChIKey=HPPHJKXAMLTMLI-UHFFFAOYSA-N
Data  1 IC50
  Tab Delimited (TSV)   2D SDfile   Computed 3D by Vconf -m prep SDfile
Find this compound or compounds like it in BindingDB:
Activity Spreadsheet -- Enzyme Inhibition Constant Data from BindingDB
Found 1 hit for monomerid = 50507263
TargetProstaglandin G/H synthase 2(Homo sapiens (Human))
Universidad Tecnol£Gica De Pereira
Curated by ChEMBL
LigandPNGBDBM50507263(CHEMBL4474936)
Affinity DataIC50:  1.01E+4nM. Assay description: Inhibition of recombinant human COX2 assessed as decrease in PGE2 release after 10 mins by ELISA
Ligand InfoPC cidPC sid
In DepthDetails ArticlePubMed