BDBM50507795 CHEMBL4555241
SMILES COc1cccc(c1)C(C)(C)NC[C@@H](O)[C@H](Cc1ccccc1)NC(=O)c1cc(cc(c1)C(=O)NCC1CC1)N1CCCCC1
InChI Key InChIKey=JPXZSPXKQLJMSO-SZAHLOSFSA-N
Data  4 IC50
  Tab Delimited (TSV)   2D SDfile   Computed 3D by Vconf -m prep SDfile
Find this compound or compounds like it in BindingDB:
Activity Spreadsheet -- Enzyme Inhibition Constant Data from BindingDB
Found 4 hits for monomerid = 50507795
TargetPlasmepsin II(Plasmodium falciparum)
Latvian Institute Of Organic Synthesis
Curated by ChEMBL
LigandPNGBDBM50507795(CHEMBL4555241)
Affinity DataIC50:  500nM. Assay description: Inhibition of Plasmodium falciparum plasmepsin 2 using DABCYL-Glu-Arg-Nle-Phe-Leu-Ser-Phe-Pro-EDANS as substrate preincubated for 30 mins followed by...
Ligand InfoPC cidPC sid
In DepthDetails ArticlePubMed
TargetPlasmepsin IV [1-448](Plasmodium falciparum)
Latvian Institute Of Organic Synthesis
Curated by ChEMBL
LigandPNGBDBM50507795(CHEMBL4555241)
Affinity DataIC50:  30nM. Assay description: Inhibition of Plasmodium falciparum plasmepsin 4 using DABCYL-Glu-Arg-Nle-Phe-Leu-Ser-Phe-Pro-EDANS as substrate preincubated for 30 mins followed by...
Ligand InfoPC cidPC sid
In DepthDetails ArticlePubMed
TargetPlasmepsin I(Plasmodium falciparum)
Latvian Institute Of Organic Synthesis
Curated by ChEMBL
LigandPNGBDBM50507795(CHEMBL4555241)
Affinity DataIC50:  1.80E+3nM. Assay description: Inhibition of Plasmodium falciparum plasmepsin 1 using DABCYL-Glu-Arg-Nle-Phe-Leu-Ser-Phe-Pro-EDANS as substrate preincubated for 30 mins followed by...
Ligand InfoPC cidPC sid
In DepthDetails ArticlePubMed
TargetCathepsin D(Homo sapiens (Human))
Latvian Institute Of Organic Synthesis
Curated by ChEMBL
LigandPNGBDBM50507795(CHEMBL4555241)
Affinity DataIC50:  760nM. Assay description: Inhibition of human cathepsin D using DABCYL-Glu-Arg-Nle-Phe-Leu-Ser-Phe-Pro-EDANS as substrate preincubated for 30 mins followed by substrate additi...
Ligand InfoPC cidPC sid
In DepthDetails ArticlePubMed