BDBM50507815 CHEMBL4449532
SMILES CCCN(CCC)C(=O)c1cc(F)cc(c1)C(=O)N[C@@H](Cc1ccccc1)[C@H](O)CNC(C)(C)c1cccc(OC)c1
InChI Key InChIKey=KGUVGCXOHCGRTK-IOWSJCHKSA-N
Data  4 IC50
  Tab Delimited (TSV)   2D SDfile   Computed 3D by Vconf -m prep SDfile
Find this compound or compounds like it in BindingDB:
Activity Spreadsheet -- Enzyme Inhibition Constant Data from BindingDB
Found 4 hits for monomerid = 50507815
TargetPlasmepsin I(Plasmodium falciparum)
Latvian Institute Of Organic Synthesis
Curated by ChEMBL
LigandPNGBDBM50507815(CHEMBL4449532)
Affinity DataIC50:  1.10E+3nM. Assay description: Inhibition of Plasmodium falciparum plasmepsin 1 using DABCYL-Glu-Arg-Nle-Phe-Leu-Ser-Phe-Pro-EDANS as substrate preincubated for 30 mins followed by...
Ligand InfoPC cidPC sid
In DepthDetails ArticlePubMed
TargetPlasmepsin II(Plasmodium falciparum)
Latvian Institute Of Organic Synthesis
Curated by ChEMBL
LigandPNGBDBM50507815(CHEMBL4449532)
Affinity DataIC50:  1.10E+3nM. Assay description: Inhibition of Plasmodium falciparum plasmepsin 2 using DABCYL-Glu-Arg-Nle-Phe-Leu-Ser-Phe-Pro-EDANS as substrate preincubated for 30 mins followed by...
Ligand InfoPC cidPC sid
In DepthDetails ArticlePubMed
TargetCathepsin D(Homo sapiens (Human))
Latvian Institute Of Organic Synthesis
Curated by ChEMBL
LigandPNGBDBM50507815(CHEMBL4449532)
Affinity DataIC50:  1.00E+3nM. Assay description: Inhibition of human cathepsin D using DABCYL-Glu-Arg-Nle-Phe-Leu-Ser-Phe-Pro-EDANS as substrate preincubated for 30 mins followed by substrate additi...
Ligand InfoPC cidPC sid
In DepthDetails ArticlePubMed
TargetPlasmepsin IV [1-448](Plasmodium falciparum)
Latvian Institute Of Organic Synthesis
Curated by ChEMBL
LigandPNGBDBM50507815(CHEMBL4449532)
Affinity DataIC50:  50nM. Assay description: Inhibition of Plasmodium falciparum plasmepsin 4 using DABCYL-Glu-Arg-Nle-Phe-Leu-Ser-Phe-Pro-EDANS as substrate preincubated for 30 mins followed by...
Ligand InfoPC cidPC sid
In DepthDetails ArticlePubMed