BDBM50508423 CHEMBL4449491
SMILES N[C@@H](Cc1ccc(O)cc1)C(=O)N1CCC[C@H]1C(=O)N[C@@H](Cc1ccccc1)C(=O)N[C@@H](Cc1ccccc1)C(=O)N[C@@H](CCCCNC(=O)[C@H](Cc1ccccc1)NC(=O)[C@H](CCCNC(N)=N)NC(=O)C12CC3CC(CC(C3)C1)C2)C(N)=O
InChI Key InChIKey=HFQCMAZSXNBPRQ-LKKGPLLNSA-N
Data  2 IC50  6 EC50
  Tab Delimited (TSV)   2D SDfile   Computed 3D by Vconf -m prep SDfile
Find this compound or compounds like it in BindingDB:
Activity Spreadsheet -- Enzyme Inhibition Constant Data from BindingDB
Found 8 hits for monomerid = 50508423
TargetMu-type opioid receptor(Homo sapiens (Human))
Lanzhou University
Curated by ChEMBL
LigandPNGBDBM50508423(CHEMBL4449491)
Affinity DataEC50:  1.77E+3nM. Assay description: Agonist activity at mu-opioid receptor (unknown origin) expressed in HEK293A cells assessed as inhibition of forskolin-induced cAMP accumulation meas...
Ligand InfoPC cidPC sid
In DepthDetails ArticlePubMed
TargetNeuropeptide FF receptor 2(Homo sapiens (Human))
Lanzhou University
Curated by ChEMBL
LigandPNGBDBM50508423(CHEMBL4449491)
Affinity DataEC50:  158nM. Assay description: Agonist activity at NPFF2 receptor (unknown origin) expressed in HEK293A cells assessed as inhibition of forskolin-stimulated cAMP accumulation measu...
Ligand InfoPC cidPC sid
In DepthDetails ArticlePubMed
TargetDelta-type opioid receptor(Homo sapiens (Human))
Lanzhou University
Curated by ChEMBL
LigandPNGBDBM50508423(CHEMBL4449491)
Affinity DataEC50:  2.24E+3nM. Assay description: Agonist activity at delta-opioid receptor (unknown origin) expressed in HEK293A cells assessed as inhibition of forskolin-induced cAMP accumulation m...
Ligand InfoPC cidPC sid
In DepthDetails ArticlePubMed
TargetMu-type opioid receptor(Homo sapiens (Human))
Lanzhou University
Curated by ChEMBL
LigandPNGBDBM50508423(CHEMBL4449491)
Affinity DataEC50:  1.77E+3nM. Assay description: Agonist activity at mu-opioid receptor (unknown origin) expressed in HEK293A cells assessed as inhibition of forskolin-induced cAMP accumulation meas...
Ligand InfoPC cidPC sid
In DepthDetails ArticlePubMed
TargetNeuropeptide FF receptor 2(Homo sapiens (Human))
Lanzhou University
Curated by ChEMBL
LigandPNGBDBM50508423(CHEMBL4449491)
Affinity DataIC50:  520nM. Assay description: Antagonist activity at NPFF2 receptor (unknown origin) expressed in HEK293A cells assessed as reversal of NPPF induced inhibition of forskolin-stimul...
Ligand InfoPC cidPC sid
In DepthDetails ArticlePubMed
TargetNeuropeptide FF receptor 2(Homo sapiens (Human))
Lanzhou University
Curated by ChEMBL
LigandPNGBDBM50508423(CHEMBL4449491)
Affinity DataEC50:  170nM. Assay description: Agonist activity at NPFF2 receptor (unknown origin) expressed in HEK293A cells assessed as inhibition of forskolin-stimulated cAMP accumulation measu...
Ligand InfoPC cidPC sid
In DepthDetails ArticlePubMed
TargetDelta-type opioid receptor(Homo sapiens (Human))
Lanzhou University
Curated by ChEMBL
LigandPNGBDBM50508423(CHEMBL4449491)
Affinity DataEC50:  2.24E+3nM. Assay description: Agonist activity at delta-opioid receptor (unknown origin) expressed in HEK293A cells assessed as inhibition of forskolin-induced cAMP accumulation m...
Ligand InfoPC cidPC sid
In DepthDetails ArticlePubMed
TargetNeuropeptide FF receptor 1(Homo sapiens (Human))
Lanzhou University
Curated by ChEMBL
LigandPNGBDBM50508423(CHEMBL4449491)
Affinity DataIC50:  520nM. Assay description: Antagonist activity at NPFF1 receptor (unknown origin) expressed in HEK293A cells assessed as reversal of NPPF induced inhibition of forskolin-stimul...
Ligand InfoPC cidPC sid
In DepthDetails ArticlePubMed