BDBM50509146 CHEMBL4303275
SMILES CCn1c(N)c(C(=O)NC)c(=O)c2ccc(nc12)C#C[C@@](C)(O)COC
InChI Key InChIKey=PFMPOBVAYMTUOX-GOSISDBHSA-N
Data  3 IC50
  Tab Delimited (TSV)   2D SDfile   Computed 3D by Vconf -m prep SDfile
Find this compound or compounds like it in BindingDB:
Activity Spreadsheet -- Enzyme Inhibition Constant Data from BindingDB
Found 3 hits for monomerid = 50509146
TargetVascular endothelial growth factor receptor 2(Homo sapiens (Human))
Korea University
Curated by ChEMBL
LigandPNGBDBM50509146(CHEMBL4303275)
Affinity DataIC50:  67nM. Assay description: Inhibition of human VEGFR2 using poly[Glu:Tyr] (4:1) substrate and [gamma-33P]-ATP by radiometric biochemical kinase assay
In DepthDetails ArticlePubMed
TargetVascular endothelial growth factor receptor 3(Homo sapiens (Human))
Korea University
Curated by ChEMBL
LigandPNGBDBM50509146(CHEMBL4303275)
Affinity DataIC50:  1.20nM. Assay description: Inhibition of human VEGFR3 using poly[Glu:Tyr] (4:1) substrate and [gamma-33P]-ATP by radiometric biochemical kinase assay
In DepthDetails ArticlePubMed
TargetReceptor-type tyrosine-protein kinase FLT3(Homo sapiens (Human))
Korea University
Curated by ChEMBL
LigandPNGBDBM50509146(CHEMBL4303275)
Affinity DataIC50:  290nM. Assay description: Inhibition of human FLT3 using EAIYAAPFAKKK substrate and [gamma-33P]-ATP by radiometric biochemical kinase assay
In DepthDetails ArticlePubMed