BDBM50509369 CHEMBL4548361
SMILES COc1cc(Br)cc2[nH]c(I)c(-c3cnc(o3)-c3ccc[nH]3)c12
InChI Key InChIKey=NDWPRZFOCQREKV-UHFFFAOYSA-N
Data  13 IC50
  Tab Delimited (TSV)   2D SDfile   Computed 3D by Vconf -m prep SDfile
Find this compound or compounds like it in BindingDB:
Activity Spreadsheet -- Enzyme Inhibition Constant Data from BindingDB
Found 13 hits for monomerid = 50509369
TargetMitogen-activated protein kinase 15(Homo sapiens (Human))
Uit - The Arctic University Of Norway
Curated by ChEMBL
LigandPNGBDBM50509369(CHEMBL4548361)
Affinity DataIC50: >1.00E+4nM. Assay description: Inhibition of ERK8 (unknown origin) by [33P]-ATP filter binding kinase assay
Ligand InfoPC cidPC sid
In DepthDetails ArticlePubMed
TargetMitogen-activated protein kinase kinase kinase 7(Homo sapiens (Human))
Uit - The Arctic University Of Norway
Curated by ChEMBL
LigandPNGBDBM50509369(CHEMBL4548361)
Affinity DataIC50:  1.80E+4nM. Assay description: Inhibition of TAK1 (unknown origin) by [33P]-ATP filter binding kinase assay
Ligand InfoPC cidPC sid
In DepthDetails ArticlePubMed
TargetAurora kinase B(Homo sapiens (Human))
Uit - The Arctic University Of Norway
Curated by ChEMBL
LigandPNGBDBM50509369(CHEMBL4548361)
Affinity DataIC50:  3.10E+4nM. Assay description: Inhibition of Aurora B (unknown origin) by [33P]-ATP filter binding kinase assay
Ligand InfoPC cidPC sid
In DepthDetails ArticlePubMed
TargetDual specificity tyrosine-phosphorylation-regulated kinase 1A(Homo sapiens (Human))
Uit - The Arctic University Of Norway
Curated by ChEMBL
LigandPNGBDBM50509369(CHEMBL4548361)
Affinity DataIC50: >1.00E+4nM. Assay description: Inhibition of DYRK1A (unknown origin) by [33P]-ATP filter binding kinase assay
Ligand InfoPC cidPC sid
In DepthDetails ArticlePubMed
TargetSerine/threonine-protein kinase SIK3(Homo sapiens)
Uit - The Arctic University Of Norway
Curated by ChEMBL
LigandPNGBDBM50509369(CHEMBL4548361)
Affinity DataIC50: >1.00E+4nM. Assay description: Inhibition of SIK3 (unknown origin) by [33P]-ATP filter binding kinase assay
Ligand InfoPC cidPC sid
In DepthDetails ArticlePubMed
TargetMitogen-activated protein kinase kinase kinase 9(Homo sapiens (Human))
Uit - The Arctic University Of Norway
Curated by ChEMBL
LigandPNGBDBM50509369(CHEMBL4548361)
Affinity DataIC50:  2.10E+4nM. Assay description: Inhibition of MLK1 (unknown origin) by [33P]-ATP filter binding kinase assay
Ligand InfoPC cidPC sid
In DepthDetails ArticlePubMed
TargetSerine/threonine-protein kinase pim-1(Homo sapiens (Human))
Uit - The Arctic University Of Norway
Curated by ChEMBL
LigandPNGBDBM50509369(CHEMBL4548361)
Affinity DataIC50:  1.80E+4nM. Assay description: Inhibition of PIM1 (unknown origin) by [33P]-ATP filter binding kinase assay
Ligand InfoPC cidPC sid
In DepthDetails ArticlePubMed
TargetReceptor-interacting serine/threonine-protein kinase 2(Homo sapiens (Human))
Uit - The Arctic University Of Norway
Curated by ChEMBL
LigandPNGBDBM50509369(CHEMBL4548361)
Affinity DataIC50: >1.00E+4nM. Assay description: Inhibition of RIPK2 (unknown origin) by [33P]-ATP filter binding kinase assay
Ligand InfoPC cidPC sid
In DepthDetails ArticlePubMed
TargetSerine/threonine-protein kinase pim-2(Homo sapiens (Human))
Uit - The Arctic University Of Norway
Curated by ChEMBL
LigandPNGBDBM50509369(CHEMBL4548361)
Affinity DataIC50: >1.00E+4nM. Assay description: Inhibition of PIM2 (unknown origin) by [33P]-ATP filter binding kinase assay
Ligand InfoPC cidPC sid
In DepthDetails ArticlePubMed
TargetSerine/threonine-protein kinase pim-3(Homo sapiens (Human))
Uit - The Arctic University Of Norway
Curated by ChEMBL
LigandPNGBDBM50509369(CHEMBL4548361)
Affinity DataIC50: >1.00E+4nM. Assay description: Inhibition of PIM3 (unknown origin) by [33P]-ATP filter binding kinase assay
Ligand InfoPC cidPC sid
In DepthDetails ArticlePubMed
TargetMitogen-activated protein kinase kinase kinase kinase 2(Homo sapiens (Human))
Uit - The Arctic University Of Norway
Curated by ChEMBL
LigandPNGBDBM50509369(CHEMBL4548361)
Affinity DataIC50:  4.00E+4nM. Assay description: Inhibition of GCK (unknown origin) by [33P]-ATP filter binding kinase assay
Ligand InfoPC cidPC sid
In DepthDetails ArticlePubMed
TargetAurora kinase A(Homo sapiens (Human))
Uit - The Arctic University Of Norway
Curated by ChEMBL
LigandPNGBDBM50509369(CHEMBL4548361)
Affinity DataIC50: >1.00E+4nM. Assay description: Inhibition of Aurora A (unknown origin) by [33P]-ATP filter binding kinase assay
Ligand InfoPC cidPC sid
In DepthDetails ArticlePubMed
TargetMitogen-activated protein kinase kinase kinase 11(Homo sapiens (Human))
Uit - The Arctic University Of Norway
Curated by ChEMBL
LigandPNGBDBM50509369(CHEMBL4548361)
Affinity DataIC50:  1.90E+4nM. Assay description: Inhibition of MLK3 (unknown origin) by [33P]-ATP filter binding kinase assay
Ligand InfoPC cidPC sid
In DepthDetails ArticlePubMed