BDBM50510339 CHEMBL4547118
SMILES CC(C)(C)c1ccc(cn1)-c1ccc(cc1)S(=O)(=O)CC(C)(C)C(=O)N[C@@H](CC(N)=O)C#N
InChI Key InChIKey=XKEUBOPSBXBIEK-SFHVURJKSA-N
Data  1 IC50
  Tab Delimited (TSV)   2D SDfile   Computed 3D by Vconf -m prep SDfile
Find this compound or compounds like it in BindingDB:
Activity Spreadsheet -- Enzyme Inhibition Constant Data from BindingDB
Found 1 hit for monomerid = 50510339
TargetLegumain(Homo sapiens (Human))
Queen'S University Belfast
Curated by ChEMBL
LigandPNGBDBM50510339(CHEMBL4547118)
Affinity DataIC50:  1.40nM. Assay description: Inhibition of recombinant human legumain using Z-Ala-Ala-Asn-AMC as substrate measured for every 2 mins for 60 mins by fluorescence-based microplate ...
Ligand InfoPC cidPC sid
In DepthDetails ArticlePubMed