BDBM50510657 CHEMBL4458682
SMILES Brc1ccc(cc1)C(=O)NC(=S)Nc1cccc(c1)-c1nc2ccccc2o1
InChI Key InChIKey=DLFZLQAHVYUWTR-UHFFFAOYSA-N
Data  1 IC50
  Tab Delimited (TSV)   2D SDfile   Computed 3D by Vconf -m prep SDfile
Find this compound or compounds like it in BindingDB:
Activity Spreadsheet -- Enzyme Inhibition Constant Data from BindingDB
Found 1 hit for monomerid = 50510657
TargetDual specificity protein phosphatase 1(Homo sapiens (Human))
Anticancer Agent Research Center
Curated by ChEMBL
LigandPNGBDBM50510657(CHEMBL4458682)
Affinity DataIC50:  4.80E+3nM. Assay description: Inhibition of His-tagged DUSP1 catalytic domain (152 to 323 residues) (unknown origin) using DiFMUP as substrate incubated for 30 mins by spectrofluo...
Ligand InfoPC cidPC sid
In DepthDetails ArticlePubMed