BDBM50511570 CHEMBL4442053
SMILES CN1CCCc2c1nc([nH]c2=O)N1CCC2(CC1)C(=O)N(CS(C)(=O)=O)c1cc(F)cc(F)c21
InChI Key InChIKey=QHYBVVNCUYAMLN-UHFFFAOYSA-N
Data  4 IC50
  Tab Delimited (TSV)   2D SDfile   Computed 3D by Vconf -m prep SDfile
Find this compound or compounds like it in BindingDB:
Activity Spreadsheet -- Enzyme Inhibition Constant Data from BindingDB
Found 4 hits for monomerid = 50511570
TargetPoly [ADP-ribose] polymerase tankyrase-1(Homo sapiens (Human))
Japanese Foundation For Cancer Research
Curated by ChEMBL
LigandPNGBDBM50511570(CHEMBL4442053)
Affinity DataIC50:  4.30nM. Assay description: Inhibition of recombinant human N-terminal TEV cleavage site-fused/FLAG-poly his-tagged TNKS SAM-PARP domain (1024 to 1327 residues) expressed in Esc...
Ligand InfoPC cidPC sid
In DepthDetails ArticlePubMed
TargetPoly [ADP-ribose] polymerase tankyrase-1/tankyrase-2(Homo sapiens (Human))
Japanese Foundation For Cancer Research
Curated by ChEMBL
LigandPNGBDBM50511570(CHEMBL4442053)
Affinity DataIC50:  5.70nM. Assay description: Inhibition of TNKS/TNKS2 (unknown origin) expressed in human DLD1 cells assessed as reduction in Wnt-signaling measured after 24 hrs by TCF-luciferas...
Ligand InfoPC cidPC sid
In DepthDetails ArticlePubMed
TargetPoly [ADP-ribose] polymerase tankyrase-1/tankyrase-2(Homo sapiens (Human))
Japanese Foundation For Cancer Research
Curated by ChEMBL
LigandPNGBDBM50511570(CHEMBL4442053)
Affinity DataIC50:  0.100nM. Assay description: Inhibition of TNKS/TNKS2 (unknown origin) expressed in HEK293 cells assessed as reduction in Wnt-signaling measured after 24 hrs by TCF-luciferase re...
Ligand InfoPC cidPC sid
In DepthDetails ArticlePubMed
TargetPoly [ADP-ribose] polymerase tankyrase-2(Homo sapiens (Human))
Japanese Foundation For Cancer Research
Curated by ChEMBL
LigandPNGBDBM50511570(CHEMBL4442053)
Affinity DataIC50:  5.5nM. Assay description: Inhibition of recombinant human N-terminal TEV cleavage site-fused/FLAG-poly his-tagged TNKS2 ARC5-SAM-PARP domain (613 to 1166 residues) expressed i...
Ligand InfoPC cidPC sid
In DepthDetails ArticlePubMed