BDBM50512142 CHEMBL4543727
SMILES Clc1ccccc1-n1cc(nn1)-c1ccccc1NS(=O)(=O)c1c[nH]c(=O)[nH]c1=O
InChI Key InChIKey=YFTGDKXGNZBZCI-UHFFFAOYSA-N
Data  1 IC50
  Tab Delimited (TSV)   2D SDfile   Computed 3D by Vconf -m prep SDfile
Find this compound or compounds like it in BindingDB:
Activity Spreadsheet -- Enzyme Inhibition Constant Data from BindingDB
Found 1 hit for monomerid = 50512142
TargetPolyunsaturated fatty acid lipoxygenase ALOX15B(Rattus norvegicus)
China Medical University
Curated by ChEMBL
LigandPNGBDBM50512142(CHEMBL4543727)
Affinity DataIC50:  870nM. Assay description: Inhibition of human thymidylate synthase using dUMP as substrate by spectrophotometric method
Ligand InfoPC cidPC sid
In DepthDetails ArticlePubMed