BDBM50512940 CHEMBL3742450
SMILES Cn1nc(O)c(CC(N)C(O)=O)n1
InChI Key InChIKey=INIGHNGDJJNUCU-UHFFFAOYSA-N
Data  5 KI  4 EC50
PDB links: 1 PDB ID matches this monomer.
  Tab Delimited (TSV)   2D SDfile   Computed 3D by Vconf -m prep SDfile
Find this compound or compounds like it in BindingDB:
Activity Spreadsheet -- Enzyme Inhibition Constant Data from BindingDB
Found 9 hits for monomerid = 50512940
TargetGlutamate receptor 2(Rattus norvegicus)
University Of Turin
Curated by ChEMBL
LigandPNGBDBM50512940(CHEMBL3742450)
Affinity DataKi:  1.97E+3nM. Assay description: Displacement of (RS)-[3H]AMPA from recombinant rat GluA2-ABD expressed in baculovirus infected Sf9 insect cell membranes
Ligand InfoPC cidPC sidPDB
TargetGlutamate receptor 2(Rattus norvegicus)
University Of Turin
Curated by ChEMBL
LigandPNGBDBM50512940(CHEMBL3742450)
Affinity DataKi:  4.38E+3nM. Assay description: Displacement of (RS)-[3H]AMPA from recombinant rat GluA2(R) expressed in baculovirus infected Sf9 insect cell membranes
Ligand InfoPC cidPC sidPDB
TargetGlutamate receptor 3(RAT)
University Of Turin
Curated by ChEMBL
LigandPNGBDBM50512940(CHEMBL3742450)
Affinity DataKi:  4.89E+3nM. Assay description: Displacement of (RS)-[3H]AMPA from recombinant rat GluA3 expressed in baculovirus infected Sf9 insect cell membranes
Ligand InfoPC cidPC sidPDB
TargetGlutamate receptor 4(Rattus norvegicus)
University Of Turin
Curated by ChEMBL
LigandPNGBDBM50512940(CHEMBL3742450)
Affinity DataKi:  1.16E+4nM. Assay description: Displacement of (RS)-[3H]AMPA from recombinant rat GluA4 expressed in baculovirus infected Sf9 insect cell membranes
Ligand InfoPC cidPC sidPDB
TargetGlutamate receptor 1(Rattus norvegicus (Rat))
University Of Turin
Curated by ChEMBL
LigandPNGBDBM50512940(CHEMBL3742450)
Affinity DataKi:  7.30E+4nM. Assay description: Displacement of (RS)-[3H]AMPA from recombinant rat GluA1 expressed in baculovirus infected Sf9 insect cell membranes
Ligand InfoPC cidPC sidPDB
In DepthDetails ArticlePubMed
TargetGlutamate receptor 2(Homo sapiens (Human))
University Of Turin
Curated by ChEMBL
LigandPNGBDBM50512940(CHEMBL3742450)
Affinity DataEC50: >1.00E+6nM. Assay description: Agonist activity at GluA2(Q) receptor (unknown origin) expressed in HEK293 cells assessed induction of S-glutamate-induced calcium flux measured afte...
Ligand InfoPC cidPC sidPDB
TargetGlutamate receptor 3(Homo sapiens (Human))
University Of Turin
Curated by ChEMBL
LigandPNGBDBM50512940(CHEMBL3742450)
Affinity DataEC50: >1.00E+6nM. Assay description: Agonist activity at GluA3 receptor (unknown origin) expressed in HEK293 cells assessed induction of S-glutamate-induced calcium flux measured after 9...
Ligand InfoPC cidPC sidPDB
TargetGlutamate receptor 4(Homo sapiens (Human))
University Of Turin
Curated by ChEMBL
LigandPNGBDBM50512940(CHEMBL3742450)
Affinity DataEC50:  1.00E+5nM. Assay description: Agonist activity at GluA4 receptor (unknown origin) expressed in HEK293 cells assessed induction of S-glutamate-induced calcium flux measured after 9...
Ligand InfoPC cidPC sidPDB
In DepthDetails ArticlePubMed
TargetGlutamate receptor 4(Homo sapiens (Human))
University Of Turin
Curated by ChEMBL
LigandPNGBDBM50512940(CHEMBL3742450)
Affinity DataEC50:  1.00E+5nM. Assay description: Agonist activity at GluA4 receptor (unknown origin) expressed in HEK293 cells assessed induction of S-glutamate-induced calcium flux measured after 9...
Ligand InfoPC cidPC sidPDB
In DepthDetails ArticlePubMed