BDBM50514208 CHEMBL4469850::US11274105, Example 61
SMILES [H][C@@]12CC[C@@]1([H])[C@@H](O)\C=C\CCN(C)C(=O)C[C@](OC)(C(O)=O)c1ccc3OC[C@]4(CCCc5cc(Cl)ccc45)CN(C2)c3c1
InChI Key InChIKey=RVIMMRAWTCRIJI-GBIPVCRUSA-N
Data  2 KI  3 IC50
  Tab Delimited (TSV)   2D SDfile   Computed 3D by Vconf -m prep SDfile
Find this compound or compounds like it in BindingDB:
Activity Spreadsheet -- Enzyme Inhibition Constant Data from BindingDB
Found 5 hits for monomerid = 50514208
LigandPNGBDBM50514208(CHEMBL4469850 | US11274105, Example 61)
Affinity DataKi:  0.275nM. Assay description: The inhibition of the Mcl-1/Bim interaction was measured using a time-resolved fluorescence resonance energy transfer (TR-FRET) assay. The recombinan...
Ligand InfoPC cidPC sid
In DepthDetails US Patent
LigandPNGBDBM50514208(CHEMBL4469850 | US11274105, Example 61)
Affinity DataKi:  0.280nM. Assay description: Inhibition of recombinant C-terminal His6x-tagged human Mcl-1 (171 to 327 residues) interaction with biotinylated human Bim (51 to 76 residues) incub...
Ligand InfoPC cidPC sid
In DepthDetails ArticlePubMed
LigandPNGBDBM50514208(CHEMBL4469850 | US11274105, Example 61)
Affinity DataIC50:  16.7nM. Assay description: For Mcl-1 TR-FRET assay with 5% human serum, the same assay condition was used except for the addition of 5% human serum (Bioreclamation, Westbury, N...
Ligand InfoPC cidPC sid
In DepthDetails US Patent
LigandPNGBDBM50514208(CHEMBL4469850 | US11274105, Example 61)
Affinity DataIC50:  1.30nM. Assay description: Inhibition of recombinant C-terminal His6x-tagged human Mcl-1 (171 to 327 residues) interaction with biotinylated human Bim (51 to 76 residues) incub...
Ligand InfoPC cidPC sid
In DepthDetails ArticlePubMed
LigandPNGBDBM50514208(CHEMBL4469850 | US11274105, Example 61)
Affinity DataIC50:  1.31nM. Assay description: The inhibition of the Mcl-1/Bim interaction was measured using a time-resolved fluorescence resonance energy transfer (TR-FRET) assay. The recombinan...
Ligand InfoPC cidPC sid
In DepthDetails US Patent