BDBM50514487 CHEMBL1230705
SMILES CCCCCc1ccc(cc1)C(=O)N(Cc1ccc(cc1)N(C)c1ccncc1)C1CCN(CCC(C)C)CC1
InChI Key InChIKey=WRFRQUOWNCJODU-UHFFFAOYSA-N
Data  3 IC50
PDB links: 1 PDB ID matches this monomer.
  Tab Delimited (TSV)   2D SDfile   Computed 3D by Vconf -m prep SDfile
Find this compound or compounds like it in BindingDB:
Activity Spreadsheet -- Enzyme Inhibition Constant Data from BindingDB
Found 3 hits for monomerid = 50514487
TargetPlasmepsin II(Plasmodium falciparum)
University Of Zambia
Curated by ChEMBL
LigandPNGBDBM50514487(CHEMBL1230705)
Affinity DataIC50:  113nM. Assay description: Inhibition of recombinant Plasmodium falciparum Plasmepsin 2
Ligand InfoPC cidPC sidPDB
TargetPlasmepsin IV [1-448](Plasmodium falciparum)
University Of Zambia
Curated by ChEMBL
LigandPNGBDBM50514487(CHEMBL1230705)
Affinity DataIC50:  1.94E+4nM. Assay description: Inhibition of recombinant Plasmodium falciparum Plasmepsin 4
Ligand InfoPC cidPC sidPDB
In DepthDetails ArticlePubMed
TargetPlasmepsin I(Plasmodium falciparum)
University Of Zambia
Curated by ChEMBL
LigandPNGBDBM50514487(CHEMBL1230705)
Affinity DataIC50:  1.12E+3nM. Assay description: Inhibition of recombinant Plasmodium falciparum Plasmepsin 1
Ligand InfoPC cidPC sidPDB
In DepthDetails ArticlePubMed