BDBM50514489 CHEMBL4537622
SMILES CCCCCc1ccc(cc1)C(=O)N(Cc1ccc(o1)-c1ccc(Cl)c(Cl)c1)C1CCN(CCC(C)C)CC1
InChI Key InChIKey=NYVBCXDVWVZUQX-UHFFFAOYSA-N
Data  3 IC50
  Tab Delimited (TSV)   2D SDfile   Computed 3D by Vconf -m prep SDfile
Find this compound or compounds like it in BindingDB:
Activity Spreadsheet -- Enzyme Inhibition Constant Data from BindingDB
Found 3 hits for monomerid = 50514489
TargetPlasmepsin II(Plasmodium falciparum)
University Of Zambia
Curated by ChEMBL
LigandPNGBDBM50514489(CHEMBL4537622)
Affinity DataIC50:  47nM. Assay description: Inhibition of recombinant Plasmodium falciparum Plasmepsin 2
Ligand InfoPC cidPC sid
In DepthDetails ArticlePubMed
TargetPlasmepsin I(Plasmodium falciparum)
University Of Zambia
Curated by ChEMBL
LigandPNGBDBM50514489(CHEMBL4537622)
Affinity DataIC50:  104nM. Assay description: Inhibition of recombinant Plasmodium falciparum Plasmepsin 1
Ligand InfoPC cidPC sid
In DepthDetails ArticlePubMed
TargetPlasmepsin IV [1-448](Plasmodium falciparum)
University Of Zambia
Curated by ChEMBL
LigandPNGBDBM50514489(CHEMBL4537622)
Affinity DataIC50:  57nM. Assay description: Inhibition of recombinant Plasmodium falciparum Plasmepsin 4
Ligand InfoPC cidPC sid
In DepthDetails ArticlePubMed