BDBM50516713 CHEMBL4448535
SMILES Clc1ccc2c(-[#6]-[#6]-c3cccnc3\[#6]-2=[#6]-2/[#6]-[#6]-[#7](-[#6]-[#6]-3-[#6]-[#6]-3)-[#6]-[#6]-2)c1
InChI Key InChIKey=DIYZVIOXKMKOLR-UHFFFAOYSA-N
Data  1 KI
  Tab Delimited (TSV)   2D SDfile   Computed 3D by Vconf -m prep SDfile
Find this compound or compounds like it in BindingDB:
Activity Spreadsheet -- Enzyme Inhibition Constant Data from BindingDB
Found 1 hit for monomerid = 50516713
TargetHistamine H1 receptor(Homo sapiens (Human))
Vu University Amsterdam
Curated by ChEMBL
LigandPNGBDBM50516713(CHEMBL4448535)
Affinity DataKi:  0.631nM. Assay description: Displacement of [3H]mepyramine from N-terminal HA-tagged H1R (unknown origin) expressed in HEK293T cells measured after 4 hrs by microbeta scintillat...
Ligand InfoPC cidPC sid
In DepthDetails ArticlePubMed