BDBM50517278 CHEMBL4475293
SMILES CCCC[C@H](N)C(=O)N[C@@H]([C@@H](C)O)C(=O)N1CCC[C@H]1C(=O)N[C@@H](Cc1ccccc1)C(=O)N[C@@H](Cc1c[nH]c2ccccc12)C(=O)N[C@@H](CCCNC(N)=N)C(=O)NCC(=O)N[C@@H](C(C)C)C(=O)N[C@@H](CO)C(=O)N[C@@H](CC(C)C)C(=O)N[C@@H](CCCNC(N)=N)C(=O)N1CCC[C@H]1C(=O)N[C@@H]([C@@H](C)CC)C(=O)NCC(N)=O
InChI Key InChIKey=IVHLRICDLYXNSF-RZQIEMFVSA-N
Data  1 KI  1 EC50
  Tab Delimited (TSV)   2D SDfile   Computed 3D by Vconf -m prep SDfile
Find this compound or compounds like it in BindingDB:
Activity Spreadsheet -- Enzyme Inhibition Constant Data from BindingDB
Found 2 hits for monomerid = 50517278
TargetGrowth hormone secretagogue receptor type 1(Homo sapiens (Human))
Universit£
Curated by ChEMBL
LigandPNGBDBM50517278(CHEMBL4475293)
Affinity DataKi:  3.10nM. Assay description: Displacement of [125I]-His9 ghrelin from SNAP-tagged human GHSR expressed in HEK293T cells after 3 hrs by HTRF assay
Ligand InfoPC cidPC sid
In DepthDetails ArticlePubMed
TargetGrowth hormone secretagogue receptor type 1(Homo sapiens (Human))
Universit£
Curated by ChEMBL
LigandPNGBDBM50517278(CHEMBL4475293)
Affinity DataEC50:  48nM. Assay description: Inverse agonist activity at SNAP-tagged human GHSR expressed in HEK293T cells assessed as reduction in inositol phosphate production after 30 mins by...
Ligand InfoPC cidPC sid
In DepthDetails ArticlePubMed