BDBM50518609 CHEMBL4571215
SMILES NC(=N)NCCC[C@H](NC(=O)[C@@H]1CCCN1C(=O)OCC1c2ccccc2-c2ccccc12)C(=O)c1nc2ccccc2s1
InChI Key InChIKey=DDDBXZXECGEQRK-SVBPBHIXSA-N
Data  3 KI
  Tab Delimited (TSV)   2D SDfile   Computed 3D by Vconf -m prep SDfile
Find this compound or compounds like it in BindingDB:
Activity Spreadsheet -- Enzyme Inhibition Constant Data from BindingDB
Found 3 hits for monomerid = 50518609
TargetSuppressor of tumorigenicity 14 protein(Homo sapiens (Human))
Washington University School Of Medicine
Curated by ChEMBL
LigandPNGBDBM50518609(CHEMBL4571215)
Affinity DataKi:  0.5nM. Assay description: Inhibition of recombinant human N-terminal His6-tagged matriptase catalytic domain expressed in Escherichia coli preincubated for 30 mins followed by...
Ligand InfoPC cidPC sid
In DepthDetails ArticlePubMed
TargetSerine protease hepsin(Homo sapiens (Human))
Washington University School Of Medicine
Curated by ChEMBL
LigandPNGBDBM50518609(CHEMBL4571215)
Affinity DataKi:  391nM. Assay description: Inhibition of recombinant human C-terminal His10-tagged hepsin catalytic domain preincubated for 30 mins followed by Boc-QAR-AMC substrate addition a...
Ligand InfoPC cidPC sid
In DepthDetails ArticlePubMed
TargetHepatocyte growth factor activator(Homo sapiens (Human))
Washington University School Of Medicine
Curated by ChEMBL
LigandPNGBDBM50518609(CHEMBL4571215)
Affinity DataKi: >1.00E+4nM. Assay description: Inhibition of HGFA catalytic domain (unknown origin) preincubated for 30 mins followed by Boc-QLR-AMC substrate addition and measured for 1 hr by flu...
Ligand InfoPC cidPC sid
In DepthDetails ArticlePubMed