BDBM50519173 CHEMBL4573104
SMILES Cc1cccc(COc2ccc3c(C)c(CC(O)=O)c(=O)oc3c2C)c1
InChI Key InChIKey=POIPWHYIHJJYAK-UHFFFAOYSA-N
Data  1 IC50
  Tab Delimited (TSV)   2D SDfile   Computed 3D by Vconf -m prep SDfile
Find this compound or compounds like it in BindingDB:
Activity Spreadsheet -- Enzyme Inhibition Constant Data from BindingDB
Found 1 hit for monomerid = 50519173
TargetChloride anion exchanger(Mus musculus)
TBA
Curated by ChEMBL
LigandPNGBDBM50519173(CHEMBL4573104)
Affinity DataIC50:  500nM. Assay description: Inhibition of mouse slc26a3 expressed in FRT cells co-expressing EYFP-H148Q/I152L/F46L assessed as reduction in protein-mediated chloride/iodide exch...
In DepthDetails ArticlePubMed