BDBM50519195 CHEMBL4469915
SMILES Cc1c(OCc2cccc(c2)[N+]([O-])=O)ccc2c(C)c(CC(O)=O)c(=O)oc12
InChI Key InChIKey=FXVXNIHWINSHOT-UHFFFAOYSA-N
Data  1 IC50
  Tab Delimited (TSV)   2D SDfile   Computed 3D by Vconf -m prep SDfile
Find this compound or compounds like it in BindingDB:
Activity Spreadsheet -- Enzyme Inhibition Constant Data from BindingDB
Found 1 hit for monomerid = 50519195
TargetChloride anion exchanger(Mus musculus)
TBA
Curated by ChEMBL
LigandPNGBDBM50519195(CHEMBL4469915)
Affinity DataIC50:  500nM. Assay description: Inhibition of mouse slc26a3 expressed in FRT cells co-expressing EYFP-H148Q/I152L/F46L assessed as reduction in protein-mediated chloride/iodide exch...
Ligand InfoPC cidPC sid
In DepthDetails ArticlePubMed