BDBM50519203 CHEMBL4550735
SMILES Cc1c(OCc2cccc(Br)c2)ccc2cc(C(=O)NO)c(=O)oc12
InChI Key InChIKey=IZYZKDASIBNUGC-UHFFFAOYSA-N
Data  1 IC50
  Tab Delimited (TSV)   2D SDfile   Computed 3D by Vconf -m prep SDfile
Find this compound or compounds like it in BindingDB:
Activity Spreadsheet -- Enzyme Inhibition Constant Data from BindingDB
Found 1 hit for monomerid = 50519203
TargetChloride anion exchanger(Mus musculus)
TBA
Curated by ChEMBL
LigandPNGBDBM50519203(CHEMBL4550735)
Affinity DataIC50:  450nM. Assay description: Inhibition of mouse slc26a3 expressed in FRT cells co-expressing EYFP-H148Q/I152L/F46L assessed as reduction in protein-mediated chloride/iodide exch...
Ligand InfoPC cidPC sid
In DepthDetails ArticlePubMed