BDBM50519209 CHEMBL4436218
SMILES Cc1cccc(c1)S(=O)(=O)Oc1ccc2c(C)c(CC(O)=O)c(=O)oc2c1C
InChI Key InChIKey=KKGYRUCCQMQFCE-UHFFFAOYSA-N
Data  1 IC50
  Tab Delimited (TSV)   2D SDfile   Computed 3D by Vconf -m prep SDfile
Find this compound or compounds like it in BindingDB:
Activity Spreadsheet -- Enzyme Inhibition Constant Data from BindingDB
Found 1 hit for monomerid = 50519209
TargetChloride anion exchanger(Mus musculus)
TBA
Curated by ChEMBL
LigandPNGBDBM50519209(CHEMBL4436218)
Affinity DataIC50: >5.00E+3nM. Assay description: Inhibition of mouse slc26a3 expressed in FRT cells co-expressing EYFP-H148Q/I152L/F46L assessed as reduction in protein-mediated chloride/iodide exch...
Ligand InfoPC cidPC sid
In DepthDetails ArticlePubMed