BDBM50521379 CHEMBL4449651
SMILES OC(=O)c1ccc(cc1)-c1cn(nn1)-c1ccc(O)cc1
InChI Key InChIKey=DIYKMEHQNFDEGG-UHFFFAOYSA-N
Data  1 IC50
  Tab Delimited (TSV)   2D SDfile   Computed 3D by Vconf -m prep SDfile
Find this compound or compounds like it in BindingDB:
Activity Spreadsheet -- Enzyme Inhibition Constant Data from BindingDB
Found 1 hit for monomerid = 50521379
TargetORF 73(Human herpesvirus 8)
Institute For Pharmaceutical Research Saarland (Hips)-Helmholtz Centre For Infection Research (Hzi
Curated by ChEMBL
LigandPNGBDBM50521379(CHEMBL4449651)
Affinity DataIC50:  5.20E+4nM. Assay description: Inhibition of fluorescent labelled LBS2 DNA binding to human herpesvirus 8 C-terminal His-tagged LANA oligomerization deficient mutant DBD (1008 to 1...
Ligand InfoPC cidPC sid
In DepthDetails ArticlePubMed