BDBM50524385 CHEMBL4463459
SMILES OC[C@H]1O[C@H]([C@H](O)[C@@H]1O)n1cnc2c(ncnc12)N1CCN(CC1)c1ccc(cc1)-c1ccc(nc1)C(F)(F)F
InChI Key InChIKey=RFEMNVLOTXZLKM-PXOHRUDZSA-N
Data  2 KI
  Tab Delimited (TSV)   2D SDfile   Computed 3D by Vconf -m prep SDfile
Find this compound or compounds like it in BindingDB:
Activity Spreadsheet -- Enzyme Inhibition Constant Data from BindingDB
Found 2 hits for monomerid = 50524385
TargetAdenosine kinase(Mycobacterium tuberculosis (strain ATCC 25618 / H3...)
Texas A&M University
Curated by ChEMBL
LigandPNGBDBM50524385(CHEMBL4463459)
Affinity DataKi:  33nM. Assay description: Inhibition of wild-type N-terminal TEV cleavage site-fused/His-tagged Mycobacterium tuberculosis H37Rv adenosine kinase expressed in Escherichia coli...
Ligand InfoPC cidPC sid
In DepthDetails ArticlePubMed
TargetAdenosine kinase(Homo sapiens (Human))
Texas A&M University
Curated by ChEMBL
LigandPNGBDBM50524385(CHEMBL4463459)
Affinity DataKi:  1.60E+3nM. Assay description: Inhibition of recombinant human adenosine kinase expressed in Escherichia coli BL21 (DE3) using adenosine as substrate in presence of ATP and PEP by ...
Ligand InfoPC cidPC sid
In DepthDetails ArticlePubMed