BDBM50525031 CHEMBL4541869
SMILES COc1ccccc1N1CCC2(CCN(CCCSc3nnc(-c4ccc(cc4)N(C)C)n3C)CC2)CC1
InChI Key InChIKey=RNNAVTSFWMMVQG-UHFFFAOYSA-N
Data  2 KI
  Tab Delimited (TSV)   2D SDfile   Computed 3D by Vconf -m prep SDfile
Find this compound or compounds like it in BindingDB:
Activity Spreadsheet -- Enzyme Inhibition Constant Data from BindingDB
Found 2 hits for monomerid = 50525031
TargetD(3) dopamine receptor(Homo sapiens (Human))
University Of Pennsylvania
Curated by ChEMBL
LigandPNGBDBM50525031(CHEMBL4541869)
Affinity DataKi:  138nM. Assay description: Displacement of [125I]IABN from recombinant human D3 receptor stably expressed in HEK293 cell membranes measured after 60 mins by scintillation count...
Ligand InfoPC cidPC sid
In DepthDetails ArticlePubMed
TargetD(2) dopamine receptor(Homo sapiens (Human))
University Of Pennsylvania
Curated by ChEMBL
LigandPNGBDBM50525031(CHEMBL4541869)
Affinity DataKi:  1.21E+4nM. Assay description: Displacement of [125I]IABN from recombinant human D2 long receptor stably expressed in HEK293 cell membranes measured after 60 mins by scintillation ...
Ligand InfoPC cidPC sid
In DepthDetails ArticlePubMed