BDBM50525149 CHEMBL4457006
SMILES Cc1cccc(C)c1NC(=O)C(Cc1c[nH]c2ccccc12)NCCCc1ccccc1
InChI Key InChIKey=SQJYZXVJDCAZFL-UHFFFAOYSA-N
Data  2 Kd
  Tab Delimited (TSV)   2D SDfile   Computed 3D by Vconf -m prep SDfile
Find this compound or compounds like it in BindingDB:
Activity Spreadsheet -- Enzyme Inhibition Constant Data from BindingDB
Found 2 hits for monomerid = 50525149
TargetTumor necrosis factor ligand superfamily member 11(Homo sapiens)
Shanghai Jiaotong University School Of Medicine
Curated by ChEMBL
LigandPNGBDBM50525149(CHEMBL4457006)
Affinity DataKd:  614nM. Assay description: Binding affinity to human RANKL by surface plasmon resonance analysis
Ligand InfoPC cidPC sid
In DepthDetails ArticlePubMed
TargetTumor necrosis factor(Homo sapiens (Human))
Shanghai Jiaotong University School Of Medicine
Curated by ChEMBL
LigandPNGBDBM50525149(CHEMBL4457006)
Affinity DataKd:  9.36E+4nM. Assay description: Binding affinity to human TNFalpha by surface plasmon resonance analysis
Ligand InfoPC cidPC sid
In DepthDetails ArticlePubMed