BDBM50525195 CHEMBL4586460
SMILES C[C@@H]1SC(N)=N[C@@H]1CC(O)=O
InChI Key InChIKey=MQFCGOLHKFXDRZ-IUYQGCFVSA-N
Data  5 IC50  2 EC50
  Tab Delimited (TSV)   2D SDfile   Computed 3D by Vconf -m prep SDfile
Find this compound or compounds like it in BindingDB:
Activity Spreadsheet -- Enzyme Inhibition Constant Data from BindingDB
Found 7 hits for monomerid = 50525195
TargetSodium- and chloride-dependent betaine transporter(Homo sapiens (Human))
University Of Copenhagen
Curated by ChEMBL
LigandPNGBDBM50525195(CHEMBL4586460)
Affinity DataIC50: >1.00E+5nM. Assay description: Inhibition of human BGT1 expressed in Flp-In CHO cells assessed as reduction in [3H]GABA uptake incubated for 3 mins by liquid scintillation counting...
Ligand InfoPC cidPC sid
In DepthDetails ArticlePubMed
TargetGamma-aminobutyric acid receptor subunit alpha-5/beta-2/gamma-2(Homo sapiens (Human))
University Of Copenhagen
Curated by ChEMBL
LigandPNGBDBM50525195(CHEMBL4586460)
Affinity DataEC50:  8.32E+3nM. Assay description: Agonist activity at recombinant human GABA-A alpha5beta2gamma2S receptor transiently expressed in human tsA201 cells incubated for 30 mins and measur...
Ligand InfoPC cidPC sid
In DepthDetails ArticlePubMed
TargetGamma-aminobutyric acid receptor subunit rho-1(Homo sapiens (Human))
University Of Copenhagen
Curated by ChEMBL
LigandPNGBDBM50525195(CHEMBL4586460)
Affinity DataIC50:  1.00E+5nM. Assay description: Antagonist activity at recombinant human GABA-A rho-1 receptor transiently expressed in human tsA201 cells incubated for 30 mins and measured up to 9...
Ligand InfoPC cidPC sid
In DepthDetails ArticlePubMed
TargetSodium- and chloride-dependent GABA transporter 1(Homo sapiens (Human))
University Of Copenhagen
Curated by ChEMBL
LigandPNGBDBM50525195(CHEMBL4586460)
Affinity DataIC50: >1.00E+5nM. Assay description: Inhibition of human GAT1 expressed in Flp-In CHO cells assessed as reduction in [3H]GABA uptake incubated for 3 mins by liquid scintillation counting...
Ligand InfoPC cidPC sid
In DepthDetails ArticlePubMed
TargetSodium- and chloride-dependent GABA transporter 3(Homo sapiens (Human))
University Of Copenhagen
Curated by ChEMBL
LigandPNGBDBM50525195(CHEMBL4586460)
Affinity DataIC50: >1.00E+5nM. Assay description: Inhibition of human GAT3 expressed in Flp-In CHO cells assessed as reduction in [3H]GABA uptake incubated for 3 mins by liquid scintillation counting...
Ligand InfoPC cidPC sid
In DepthDetails ArticlePubMed
TargetGamma-aminobutyric acid receptor subunit alpha-5/beta-2/gamma-2(Homo sapiens (Human))
University Of Copenhagen
Curated by ChEMBL
LigandPNGBDBM50525195(CHEMBL4586460)
Affinity DataEC50:  8.20E+3nM. Assay description: Agonist activity at recombinant human GABA-A alpha5beta2gamma2S receptor transiently expressed in human tsA201 cells incubated for 30 mins and measur...
Ligand InfoPC cidPC sid
In DepthDetails ArticlePubMed
TargetSodium- and chloride-dependent GABA transporter 2(Homo sapiens (Human))
University Of Copenhagen
Curated by ChEMBL
LigandPNGBDBM50525195(CHEMBL4586460)
Affinity DataIC50: >1.00E+5nM. Assay description: Inhibition of human GAT2 expressed in Flp-In CHO cells assessed as reduction in [3H]GABA uptake incubated for 3 mins by liquid scintillation counting...
Ligand InfoPC cidPC sid
In DepthDetails ArticlePubMed