BDBM50526406 CHEMBL4546426
SMILES COc1cc(C)c2[nH]cc(\C=N\NC(=N)NCCc3ccc(Cl)cc3)c2c1
InChI Key InChIKey=XQIIZGJSJOEPKG-BRJLIKDPSA-N
Data  3 EC50
  Tab Delimited (TSV)   2D SDfile   Computed 3D by Vconf -m prep SDfile
Find this compound or compounds like it in BindingDB:
Activity Spreadsheet -- Enzyme Inhibition Constant Data from BindingDB
Found 3 hits for monomerid = 50526406
TargetRelaxin-3 receptor 2(Homo sapiens (Human))
Novartis Institutes For Biomedical Research
Curated by ChEMBL
LigandPNGBDBM50526406(CHEMBL4546426)
Affinity DataEC50:  100nM. Assay description: Agonist activity at human RXFP4 expressed in CHOK1 cells assessed as inhibition of forskolin-stimulated intracellular cAMP accumulation preincubated ...
Ligand InfoPC cidPC sid
In DepthDetails ArticlePubMed
TargetRelaxin-3 receptor 1(Homo sapiens (Human))
Research Triangle Institute
Curated by ChEMBL
LigandPNGBDBM50526406(CHEMBL4546426)
Affinity DataEC50:  75nM. Assay description: Agonist activity at human RXFP3 expressed in human CHO-K1 cells assessed as inhibition of forskolin-induced cAMP accumulation measured after 1.5 hrs ...
Ligand InfoPC cidPC sid
In DepthDetails ArticlePubMed
TargetRelaxin-3 receptor 1(Homo sapiens (Human))
Research Triangle Institute
Curated by ChEMBL
LigandPNGBDBM50526406(CHEMBL4546426)
Affinity DataEC50:  1.30E+3nM. Assay description: Agonist activity at human RXFP3 expressed in CHOK1 cells assessed as inhibition of forskolin-stimulated intracellular cAMP accumulation preincubated ...
Ligand InfoPC cidPC sid
In DepthDetails ArticlePubMed