BDBM50526456 CHEMBL4582632
SMILES Nc1ncnc2n(nc(Br)c12)C1CCCN(C1)C(=O)C=C
InChI Key InChIKey=MACLJRDGXVTVHT-UHFFFAOYSA-N
Data  5 IC50
  Tab Delimited (TSV)   2D SDfile   Computed 3D by Vconf -m prep SDfile
Find this compound or compounds like it in BindingDB:
Activity Spreadsheet -- Enzyme Inhibition Constant Data from BindingDB
Found 5 hits for monomerid = 50526456
TargetTyrosine-protein kinase JAK1(Homo sapiens (Human))
China Pharmaceutical University
Curated by ChEMBL
LigandPNGBDBM50526456(CHEMBL4582632)
Affinity DataIC50:  168nM. Assay description: Inhibition of recombinant human GST-tagged JAK1 catalytic domain (866 to 1154 residues) expressed in baculovirus expression system using TK-biotin as...
Ligand InfoPC cidPC sid
In DepthDetails ArticlePubMed
TargetTyrosine-protein kinase JAK2(Homo sapiens (Human))
China Pharmaceutical University
Curated by ChEMBL
LigandPNGBDBM50526456(CHEMBL4582632)
Affinity DataIC50:  94nM. Assay description: Inhibition of recombinant human GST-tagged JAK2 catalytic domain (809 to 1153+9 residues) expressed in baculovirus expression system using TK-biotin ...
Ligand InfoPC cidPC sid
In DepthDetails ArticlePubMed
TargetTyrosine-protein kinase JAK2(Rattus norvegicus)
China Pharmaceutical University
Curated by ChEMBL
LigandPNGBDBM50526456(CHEMBL4582632)
Affinity DataIC50:  630nM. Assay description: Inhibition of JAK2 in Lewis rat T cells assessed as reduction in IL-2-induced cell proliferation measured after 72 hrs by alamar blue staining based ...
Ligand InfoPC cidPC sid
In DepthDetails ArticlePubMed
TargetTyrosine-protein kinase JAK2(Rattus norvegicus)
China Pharmaceutical University
Curated by ChEMBL
LigandPNGBDBM50526456(CHEMBL4582632)
Affinity DataIC50:  570nM. Assay description: Inhibition of JAK2 in Lewis rat T cells assessed as reduction in ConA/CD3/CD28-induced cell proliferation measured after 72 hrs by alamar blue staini...
Ligand InfoPC cidPC sid
In DepthDetails ArticlePubMed
TargetTyrosine-protein kinase JAK3(Homo sapiens (Human))
China Pharmaceutical University
Curated by ChEMBL
LigandPNGBDBM50526456(CHEMBL4582632)
Affinity DataIC50:  34nM. Assay description: Inhibition of recombinant human GST-tagged JAK3 catalytic domain (781 to 1124 residues) expressed in baculovirus expression system using TK-biotin as...
Ligand InfoPC cidPC sid
In DepthDetails ArticlePubMed