BDBM50527070 CHEMBL4467779
SMILES CC[C@H](C)[C@H](N)C(=O)N[C@@H](CC(N)=O)C(=O)N[C@@H](CC(C)C)C(=O)N[C@@H](CCCCN)C(=O)N[C@@H](C)C(=O)N[C@@H](CC(C)C)C(=O)N[C@@H](C)C(=O)N[C@@H](C)C(=O)N[C@@H](CC(C)C)C(=O)N[C@@H](C)C(=O)N[C@@H](CCCCN)C(=O)N[C@@H](CCCCN)C(=O)N[C@@H]([C@@H](C)CC)C(=O)N[C@@H](CC(C)C)C(O)=O
InChI Key InChIKey=YNLMPFZFVJVVBA-MVSGICTGSA-N
Data  1 KI
  Tab Delimited (TSV)   2D SDfile   Computed 3D by Vconf -m prep SDfile
Find this compound or compounds like it in BindingDB:
Activity Spreadsheet -- Enzyme Inhibition Constant Data from BindingDB
Found 1 hit for monomerid = 50527070
TargetSarcoplasmic/endoplasmic reticulum calcium ATPase 1(Oryctolagus cuniculus)
University Of Chemistry And Technology Prague
Curated by ChEMBL
LigandPNGBDBM50527070(CHEMBL4467779)
Affinity DataKi:  1.00E+3nM. Assay description: Inhibition of rabbit skeletal muscle microsomes SERCA1a by enzyme-coupled method
Ligand InfoPC cidPC sid
In DepthDetails ArticlePubMed