BDBM50527529 CHEMBL4454600
SMILES [H][C@@]12CC=CC[C@]1([H])C(=NN(C1CN(C1)c1ncnc3ccsc13)C2=O)c1ccc(OC)c(OC)c1
InChI Key InChIKey=OTBLMOBBDWRQQX-ZWKOTPCHSA-N
Data  2 KI
  Tab Delimited (TSV)   2D SDfile   Computed 3D by Vconf -m prep SDfile
Find this compound or compounds like it in BindingDB:
Activity Spreadsheet -- Enzyme Inhibition Constant Data from BindingDB
Found 2 hits for monomerid = 50527529
TargetcAMP-specific 3',5'-cyclic phosphodiesterase 4D(Homo sapiens (Human))
University Of Antwerp
Curated by ChEMBL
LigandPNGBDBM50527529(CHEMBL4454600)
Affinity DataKi:  0.562nM. Assay description: Inhibition of human PDE4D2 expressed in Escherichia coli BL21 (DE3) using cAMP as substrate by PDELight HTS cAMP phosphodiesterase Kit based
Ligand InfoPC cidPC sid
In DepthDetails ArticlePubMed
TargetPhosphodiesterase(Trypanosoma brucei)
University Of Antwerp
Curated by ChEMBL
LigandPNGBDBM50527529(CHEMBL4454600)
Affinity DataKi:  288nM. Assay description: Inhibition of Trypanosoma brucei PDEB1 (565 to 918 residues) expressed in Escherichia coli BL21 (DE3) using cAMP as substrate by PDELight HTS cAMP ph...
Ligand InfoPC cidPC sid
In DepthDetails ArticlePubMed