BDBM50527901 CHEMBL4514897
SMILES CCN(CC)CC.CCN(CC)CC.CCN(CC)CC.CO[C@H]1O[C@H](COP(O)(O)=O)[C@@H](OP(O)(O)=O)[C@H](O)[C@H]1OP(O)(O)=O
InChI Key InChIKey=BZEFQFHWSFQWKY-LJDJQCIWSA-N
Data  1 Kd
  Tab Delimited (TSV)   2D SDfile   Computed 3D by Vconf -m prep SDfile
Find this compound or compounds like it in BindingDB:
Activity Spreadsheet -- Enzyme Inhibition Constant Data from BindingDB
Found 1 hit for monomerid = 50527901
TargetInositol 1,4,5-trisphosphate receptor type 1(Rattus norvegicus)
University Of Oxford
Curated by ChEMBL
LigandPNGBDBM50527901(CHEMBL4514897)
Affinity DataKd:  0nM. Assay description: Specific binding of [3H]-Ins(1,4,5)P3 to IP3R1 in Wistar rat cerebellar membrane at 30 uM measured after 5 mins by liquid scintillation counting meth...
Ligand InfoPC cidPC sid
In DepthDetails ArticlePubMed