BDBM50528640 CHEMBL4551856
SMILES COc1cc(cc(OC)c1OC)-c1n[nH]cc1-c1ccc(C)c(F)c1
InChI Key InChIKey=OGNLEYJDYHTVOF-UHFFFAOYSA-N
Data  1 IC50
  Tab Delimited (TSV)   2D SDfile   Computed 3D by Vconf -m prep SDfile
Find this compound or compounds like it in BindingDB:
Activity Spreadsheet -- Enzyme Inhibition Constant Data from BindingDB
Found 1 hit for monomerid = 50528640
TargetSimilar to alpha-tubulin isoform 1(Bos taurus)
Universit£
Curated by ChEMBL
LigandPNGBDBM50528640(CHEMBL4551856)
Affinity DataIC50:  480nM. Assay description: Inhibition of bovine brain tubulin assembly using GTP as substrate incubated for 20 mins by spectrophotometric method
Ligand InfoPC cidPC sid
In DepthDetails ArticlePubMed