BDBM50528644 CHEMBL4449830
SMILES CCSc1ccc(cc1)-c1c[nH]nc1-c1cc(OC)c(OC)c(OC)c1
InChI Key InChIKey=LTGCVWMMQQWGIO-UHFFFAOYSA-N
Data  1 IC50
  Tab Delimited (TSV)   2D SDfile   Computed 3D by Vconf -m prep SDfile
Find this compound or compounds like it in BindingDB:
Activity Spreadsheet -- Enzyme Inhibition Constant Data from BindingDB
Found 1 hit for monomerid = 50528644
TargetSimilar to alpha-tubulin isoform 1(Bos taurus)
Universit£
Curated by ChEMBL
LigandPNGBDBM50528644(CHEMBL4449830)
Affinity DataIC50:  480nM. Assay description: Inhibition of bovine brain tubulin assembly using GTP as substrate incubated for 20 mins by spectrophotometric method
Ligand InfoPC cidPC sid
In DepthDetails ArticlePubMed